﻿"Item Id","Item URI","Dublin Core:Title","Dublin Core:Subject","Dublin Core:Description","Dublin Core:Creator","Dublin Core:Source","Dublin Core:Publisher","Dublin Core:Date","Dublin Core:Contributor","Dublin Core:Rights","Dublin Core:Relation","Dublin Core:Format","Dublin Core:Language","Dublin Core:Type","Dublin Core:Identifier","Dublin Core:Coverage","Item Type Metadata:Lesson Plan Text","Item Type Metadata:Bibliography","Item Type Metadata:Biographical Text","Item Type Metadata:Occupation","Item Type Metadata:Death Date","Item Type Metadata:Birthplace","Item Type Metadata:Birth Date","Item Type Metadata:Participants","Item Type Metadata:Event Type","Item Type Metadata:URL","Item Type Metadata:Bit Rate/Frequency","Item Type Metadata:Interviewer","Item Type Metadata:Interviewee","Item Type Metadata:Location","Item Type Metadata:Transcription","Item Type Metadata:Local URL","Item Type Metadata:Original Format","Item Type Metadata:Physical Dimensions","Item Type Metadata:Duration","Item Type Metadata:Compression","Item Type Metadata:Producer","Item Type Metadata:Director","Item Type Metadata:Text","Item Type Metadata:Time Summary","Item Type Metadata:Email Body","Item Type Metadata:Subject Line","Item Type Metadata:From","Item Type Metadata:To","Item Type Metadata:CC","Item Type Metadata:BCC","Item Type Metadata:Number of Attachments","Item Type Metadata:Standards","Item Type Metadata:Objectives","Item Type Metadata:Materials",tags,file,itemType,collection,public,featured
313,https://penninehorizons.org/items/show/313,"St Ann's Square, Luddenden - ANP00101","Cottages, Luddenden, Mill, Mullions, Oats Royd Mill","Oats Royd Mill is in the background and below it to  the left is Church Hill.","Ann Peters","Pennine Horizons Digital Archive","Pennine Horizons Digital Archive",1970s,"Ann Peters Collection","PHDA - Ann Peters Collection","Pennine Horizons Digital Archive","TIFF file 8-bit","English (U.K.)","Documentary photograph",ANP00101.tif,"Hebden Bridge",,,,,,,,,,,,,,,,,,,,,,,,,,,,,,,,,,,"Cottages,Luddenden,Mill,Mullions,Oats Royd Mill",https://penninehorizons.org/files/original/353b8a7a58406840d3f6dc983c964aad.jpg,"Still Image","Ann Peters collection",1,0
316,https://penninehorizons.org/items/show/316,"Luddenden - ANP00104","Cottages, Luddenden","Cottage at the back of Patrick’s Yard in the centre of the village.","Ann Peters","Pennine Horizons Digital Archive","Pennine Horizons Digital Archive",1970s,"Ann Peters Collection","PHDA - Ann Peters Collection","Pennine Horizons Digital Archive","TIFF file 8-bit","English (U.K.)","Documentary photograph",ANP00104.tif,"Hebden Bridge",,,,,,,,,,,,,,,,,,,,,,,,,,,,,,,,,,,"Cottages,Luddenden",https://penninehorizons.org/files/original/3bb5d50b494917122091632ac9dbb309.jpg,"Still Image","Ann Peters collection",1,0
317,https://penninehorizons.org/items/show/317,"St Ann's Square, Luddenden Village - ANP00105","Cottages, Luddenden, Mill, Mullions, Oats Royd Mill","Oats Royd Mill is in the background and below it to the let is Church Hill.","Ann Peters","Pennine Horizons Digital Archive","Pennine Horizons Digital Archive",1970s,"Ann Peters Collection","PHDA - Ann Peters Collection","Pennine Horizons Digital Archive","TIFF file 8-bit","English (U.K.)","Documentary photograph",ANP00105.tif,"Hebden Bridge",,,,,,,,,,,,,,,,,,,,,,,,,,,,,,,,,,,"Cottages,Luddenden,Mill,Mullions,Oats Royd Mill",https://penninehorizons.org/files/original/69a5da9029e33c6c61a866cac2b5dc34.jpg,"Still Image","Ann Peters collection",1,0
320,https://penninehorizons.org/items/show/320,"New Road, Luddenden - ANP00108","Cottages, Luddenden, New Road, Street Names",,"Ann Peters","Pennine Horizons Digital Archive","Pennine Horizons Digital Archive",1970s,"Ann Peters Collection","PHDA - Ann Peters Collection","Pennine Horizons Digital Archive","TIFF file 8-bit","English (U.K.)","Documentary photograph",ANP00108.tif,"Hebden Bridge",,,,,,,,,,,,,,,,,,,,,,,,,,,,,,,,,,,"Cottages,Luddenden,New Road,Street Names",https://penninehorizons.org/files/original/c37f0ebc38f21b49cc0ca561dd20368b.jpg,"Still Image","Ann Peters collection",1,0
321,https://penninehorizons.org/items/show/321,"Church Hill, Luddenden - ANP00109","Cottages, Luddenden, Mullions","Lord Nelson is just to the left. The steps on the right  lead to the cenotaph.","Ann Peters","Pennine Horizons Digital Archive","Pennine Horizons Digital Archive",1970s,"Ann Peters Collection","PHDA - Ann Peters Collection","Pennine Horizons Digital Archive","TIFF file 8-bit","English (U.K.)","Documentary photograph",ANP00109.tif,"Hebden Bridge",,,,,,,,,,,,,,,,,,,,,,,,,,,,,,,,,,,"Cottages,Luddenden,Mullions",https://penninehorizons.org/files/original/ad6830465e70b607c1fe9cc1b230b138.jpg,"Still Image","Ann Peters collection",1,0
322,https://penninehorizons.org/items/show/322,"Luddenden - ANP00110","Cottages, Luddenden","Building to the right of the bridge in the centre of the village viewed from across the river.","Ann Peters","Pennine Horizons Digital Archive","Pennine Horizons Digital Archive",1970s,"Ann Peters Collection","PHDA - Ann Peters Collection","Pennine Horizons Digital Archive","TIFF file 8-bit","English (U.K.)","Documentary photograph",ANP00110.tif,"Hebden Bridge",,,,,,,,,,,,,,,,,,,,,,,,,,,,,,,,,,,"Cottages,Luddenden",https://penninehorizons.org/files/original/159844892bdc862c7b896dda89d86bb0.jpg,"Still Image","Ann Peters collection",1,0
325,https://penninehorizons.org/items/show/325,"Booth near Luddenden - ANP00113","Cottages, Luddenden","The cottages on the right were demolished in the 1970s, and a single house was built on the site, the tree is still there, 2014. The cottages were originally owned by Murgatroyds of Oats Royd Mill.","Ann Peters","Pennine Horizons Digital Archive","Pennine Horizons Digital Archive",1970s,"Ann Peters Collection","PHDA - Ann Peters Collection","Pennine Horizons Digital Archive","TIFF file 8-bit","English (U.K.)","Documentary photograph",ANP00113.tif,"Hebden Bridge",,,,,,,,,,,,,,,,,,,,,,,,,,,,,,,,,,,"Cottages,Luddenden",https://penninehorizons.org/files/original/4e2c949ae15f3dc1cbd898bf1577320d.jpg,"Still Image","Ann Peters collection",1,0
329,https://penninehorizons.org/items/show/329,"Booth Terrace, Luddenden - ANP00117","Cottages, Luddenden",,"Ann Peters","Pennine Horizons Digital Archive","Pennine Horizons Digital Archive",1970s,"Ann Peters Collection","PHDA - Ann Peters Collection","Pennine Horizons Digital Archive","TIFF file 8-bit","English (U.K.)","Documentary photograph",ANP00117.tif,"Hebden Bridge",,,,,,,,,,,,,,,,,,,,,,,,,,,,,,,,,,,"Cottages,Luddenden",https://penninehorizons.org/files/original/7c86ed521eacca6c6a6a8740ea7e4454.jpg,"Still Image","Ann Peters collection",1,0
330,https://penninehorizons.org/items/show/330,"Booth near Luddenden - ANP00118","Booth, Cottages, Luddenden, Places",,"Ann Peters","Pennine Horizons Digital Archive","Pennine Horizons Digital Archive",1970s,"Ann Peters Collection","PHDA - Ann Peters Collection","Pennine Horizons Digital Archive","TIFF file 8-bit","English (U.K.)","Documentary photograph",ANP00118.tif,"Hebden Bridge",,,,,,,,,,,,,,,,,,,,,,,,,,,,,,,,,,,"Booth,Cottages,Luddenden",https://penninehorizons.org/files/original/b37f05b9e8a77058764eac2c65fcccd4.jpg,"Still Image","Ann Peters collection",1,0
333,https://penninehorizons.org/items/show/333,"Thorney Lane, Midgley - ANP00121","Cottages, Midgley, Oats Royd Mill, Places","Originally workers cottages for Oats Royd Mill","Ann Peters","Pennine Horizons Digital Archive","Pennine Horizons Digital Archive",1970s,"Ann Peters Collection","PHDA - Ann Peters Collection","Pennine Horizons Digital Archive","TIFF file 8-bit","English (U.K.)","Documentary photograph",ANP00121.tif,"Hebden Bridge",,,,,,,,,,,,,,,,,,,,,,,,,,,,,,,,,,,"Cottages,Midgley,Oats Royd Mill",https://penninehorizons.org/files/original/13111f0875e846404810ca0caa77f464.jpg,"Still Image","Ann Peters collection",1,0
334,https://penninehorizons.org/items/show/334,"Luddenden - ANP00122","Cottages, Luddenden, Midgley, Places","Possibly Thorney Lane Midgley.","Ann Peters","Pennine Horizons Digital Archive","Pennine Horizons Digital Archive",1970s,"Ann Peters Collection","PHDA - Ann Peters Collection","Pennine Horizons Digital Archive","TIFF file 8-bit","English (U.K.)","Documentary photograph",ANP00122.tif,"Hebden Bridge",,,,,,,,,,,,,,,,,,,,,,,,,,,,,,,,,,,"Bin,Cottages,Flagstone,Luddenden,Midgley",https://penninehorizons.org/files/original/f58c9aeefdfc13dd01ccfab92c299c67.jpg,"Still Image","Ann Peters collection",1,0
335,https://penninehorizons.org/items/show/335,"Mount Pleasant, Thorney Lane, Midgley.  - ANP00123","Cottages, Midgley, Places","Known locally as ‘Parkin’ and seen here from the rear.","Ann Peters","Pennine Horizons Digital Archive","Pennine Horizons Digital Archive",1970s,"Ann Peters Collection","PHDA - Ann Peters Collection","Pennine Horizons Digital Archive","TIFF file 8-bit","English (U.K.)","Documentary photograph",ANP00123.tif,"Hebden Bridge",,,,,,,,,,,,,,,,,,,,,,,,,,,,,,,,,,,"Cottages,Midgley",https://penninehorizons.org/files/original/b884a3750d5edb7343f53a2b0f31b4c0.jpg,"Still Image","Ann Peters collection",1,0
342,https://penninehorizons.org/items/show/342,"Duke Street, Luddenden. - ANP00130","Cottages, Luddenden","Seemingly undergoing restoration.","Ann Peters","Pennine Horizons Digital Archive","Pennine Horizons Digital Archive",1970s,"Ann Peters Collection","PHDA - Ann Peters Collection","Pennine Horizons Digital Archive","TIFF file 8-bit","English (U.K.)","Documentary photograph",ANP00130.tif,"Hebden Bridge",,,,,,,,,,,,,,,,,,,,,,,,,,,,,,,,,,,"Cottages,Luddenden",https://penninehorizons.org/files/original/ea0f9d8fe667096f31a594b6ea99d398.jpg,"Still Image","Ann Peters collection",1,0
4490,https://penninehorizons.org/items/show/4490,"Knowle Top Cottages & Stoodley Pike - DMC00209","Buildings, Cottages, Edge Hey Green, Smoke, Snow, Terrace, winter","The cottages are situated between Heptonstall and Colden","David Martin","Pennine Horizons Digital Archive","Pennine Horizons Digital Archive",2009-01-05T14:46:01,"David Martin","PHDA - David Martin Collection","Pennine Horizons Digital Archive","TIFF file 8-bit","English (U.K.)","Documentary photograph",DMC00209.TIF,",  ",,,,,,,,,,,,,,,,,,,,,,,,,,,,,,,,,,,"Buildings,Cottages,Edge Hey Green,Smoke,Snow,Terrace,winter",https://penninehorizons.org/files/original/1cf887c9aaaabe8f4d082c1886b8d6cd.jpg,"Still Image","David's Own Pictures",1,0
4633,https://penninehorizons.org/items/show/4633,"Smeakin Hill & Hardcastle Crags - DMC00361","Autumn, Buildings, Cottages, National Trust, Seasons, Trees, War memorial",,"David Martin","Pennine Horizons Digital Archive","Pennine Horizons Digital Archive",2010-10-29T15:31:30+01:00,"David Martin","PHDA - David Martin Collection","Pennine Horizons Digital Archive","TIFF file 8-bit","English (U.K.)","Documentary photograph",DMC00361.TIF,",  ",,,,,,,,,,,,,,,,,,,,,,,,,,,,,,,,,,,"Autumn,Buildings,Cottages,National Trust,Seasons,Trees,War memorial",https://penninehorizons.org/files/original/774e8e0085e4cd9268333aff54a58e4f.jpg,"Still Image","David's Own Pictures",1,0
4763,https://penninehorizons.org/items/show/4763,"New Bridge Cottages, Midgehole - DMC00492","Cottages, Feature, Forest, Landscape, Midgehole, Paths & Tracks, Places, Woodland, Woodlands, Woods","New Bridge Cottages, Midgehole (2000)","David Martin","Pennine Horizons Digital Archive","Pennine Horizons Digital Archive",2000-07-20T19:54:45+01:00,"David Martin","PHDA - David Martin Collection","Pennine Horizons Digital Archive","TIFF file 8-bit","English (U.K.)","Documentary photograph",DMC00492.tif,"53°45'28"" N 2°1'9"" W",,,,,,,,,,,,,,,,,,,,,,,,,,,,,,,,,,,"Cottages,Feature,Forest,Hebden Bridge,Landscape,Midgehole,Paths & Tracks,Upper Calder Valley,Woodland,Woodlands,Woods",https://penninehorizons.org/files/original/081f3956f780231165f46d9eec6639dc.jpg,"Still Image","David's Own Pictures",1,0
4764,https://penninehorizons.org/items/show/4764,"New Bridge Hall, Midgehole - DMC00493","Cottages, Midgehole, New Bridge Hall, Places","New Bridge Hall, Midgehole (July 2000)","David Martin","Pennine Horizons Digital Archive","Pennine Horizons Digital Archive",2000-07-10T17:14:45+01:00,"David Martin","PHDA - David Martin Collection","Pennine Horizons Digital Archive","TIFF file 8-bit","English (U.K.)","Documentary photograph",DMC00493.tif,",53°45'27"" N 2°1'7"" W",,,,,,,,,,,,,,,,,,,,,,,,,,,,,,,,,,,"Cottages,Hebden Bridge,Midgehole,New Bridge Hall,Upper Calder Valley",https://penninehorizons.org/files/original/0abc53aec291623e7df11b20e433a51e.jpg,"Still Image","David's Own Pictures",1,0
4765,https://penninehorizons.org/items/show/4765,"New Bridge, Midgehole - DMC00494","Cottages, Midgehole, Places","New Bridge Cottages, Midgehole (July 2000)","David Martin","Pennine Horizons Digital Archive","Pennine Horizons Digital Archive",2000-07-10T17:15:39+01:00,"David Martin","PHDA - David Martin Collection","Pennine Horizons Digital Archive","TIFF file 8-bit","English (U.K.)","Documentary photograph",DMC00494.tif,",53°45'29"" N 2°1'8"" W",,,,,,,,,,,,,,,,,,,,,,,,,,,,,,,,,,,"Cottages,Hebden Bridge,Midgehole,Upper Calder Valley",https://penninehorizons.org/files/original/d902e65d9c5a65c4a1790dec4b9738a9.jpg,"Still Image","David's Own Pictures",1,0
3558,https://penninehorizons.org/items/show/3558,"Lower Mill Cottages, Midgehole - DTA00208","Buildings, Cottages, Feature, Forest, Landscape, Midgehole, Places, Woodland, Woodlands, Woods",,"Donald Taylor","Pennine Horizons Digital Archive","Pennine Horizons Digital Archive","No date yet","Donald Taylor","PHDA - Donald Taylor Collection","Pennine Horizons Digital Archive","TIFF file 8-bit","English (U.K.)","Documentary photograph",DTA00208.tif,,,,,,,,,,,,,,,,,,,,,,,,,,,,,,,,,,,,"Buildings,Cottages,Feature,Forest,Landscape,Midgehole,Woodland,Woodlands,Woods",https://penninehorizons.org/files/original/62b5a7429605b3ee61c2032e0d3fe285.jpg,"Still Image","Donald Taylor collection",1,0
7309,https://penninehorizons.org/items/show/7309,"Howsham Village - HLS05913","Buildings, Cottages, People, People at Leisure","Slide 7 - The village of Howsham consists of one long street, with houses on one side only, the other side being bounded by Howsham Park. In this village stands the house (shown in the picture) in which George Hudson the 'Railway King' was born.","George Hepworth","Hebden Bridge Literary & Scientific Society","Pennine Horizons Digital Archive","1905 , 1900s","Hebden Bridge Local History Society","PHDA - Hebden Bridge Local History Society","Pennine Horizons Digital Archive","TIFF file 8-bit","English (U.K.)","Documentary photograph",HLS05913.tif,"Yorkshire, UK",,,,,,,,,,,,,,,,,,,,,,,,,,,,,,,,,,,"Buildings,Cottages,People,People at Leisure",https://penninehorizons.org/files/original/227ba12f0fee472222383c90a3db8920.jpg,"Still Image","Historic Homes of Yorkshire collection",1,0
7366,https://penninehorizons.org/items/show/7366,"Nunnington Village - HLS05970","Buildings, Cottages, Landscape, Places","Slide 1 - Nunnington, I was once told by a native of an adjoining Ryedale village, was not worth going to see, there being nothing in, or about the place of any interest what so ever. In corroboration of this statement, the writer of 'Murray's Yorkshire' sums up a description of Nunnington in four lines, and concluded by saying 'it contains nothing to detain the tourist.'

A place so totally devoid of interest, stimulated my curiosity, so I determined to pay a visit to the village, and see whether these derogatory statements were true or otherwise. Instead of which, a prettier village than Nunnington it would be difficult to find, with its ancient Church and Hall, trees and gardens everywhere, quaint old dwellings, and rustic cots, and the finest avenue of sycamores to be found in Yorkshire.","George Hepworth","Hebden Bridge Literary & Scientific Society","Pennine Horizons Digital Archive","1905 , 1900s","Hebden Bridge Local History Society","PHDA - Hebden Bridge Local History Society","Pennine Horizons Digital Archive","TIFF file 8-bit","English (U.K.)","Documentary photograph",HLS05970.tif,"Yorkshire, UK",,,,,,,,,,,,,,,,,,,,,,,,,,,,,,,,,,,"Buildings,Cottages,Landscape",https://penninehorizons.org/files/original/4af9cd91c90841061ffcaf2c9254e2eb.jpg,"Still Image","Historic Homes of Yorkshire collection",1,0
7367,https://penninehorizons.org/items/show/7367,"Nunnington Village showing the Rye - HLS05971","Buildings, Cottages, River, Thatched roof","Slide 2 - The road descends steeply to the village. The quaint looking houses are perched on the high grassy banks on either side, and before us at the foot of the descent is the Rye with its wooded foot bridge and far-off line of hills","George Hepworth","Hebden Bridge Literary & Scientific Society","Pennine Horizons Digital Archive","1905 , 1900s","Hebden Bridge Local History Society","PHDA - Hebden Bridge Local History Society","Pennine Horizons Digital Archive","TIFF file 8-bit","English (U.K.)","Documentary photograph",HLS05971.tif,"Yorkshire, UK",,,,,,,,,,,,,,,,,,,,,,,,,,,,,,,,,,,"Buildings,Cottages,River,Thatched roof",https://penninehorizons.org/files/original/8ab6b7e93a5d5b4013e1bac2668ccd44.jpg,"Still Image","Historic Homes of Yorkshire collection",1,0
7418,https://penninehorizons.org/items/show/7418,"Boat Farm formerly Boat Inn, Sprotbrough - HLS06025","Agriculture, Cottages, Hamlet","Slide 17 - On one side of the village green is the Boat Farm, formerly the Boat Inn shown in the photograph on the right. The Copley coat of arms appears over the doorway. A tradition lingers about Sprotbrough that Sir Walter Scott and a friend spent two nights at the Inn prior to the publication of 'Ivanhoe'.","George Hepworth","Hebden Bridge Literary & Scientific Society","Pennine Horizons Digital Archive","1905 , 1900s","Hebden Bridge Local History Society","PHDA - Hebden Bridge Local History Society","Pennine Horizons Digital Archive","TIFF file 8-bit","English (U.K.)","Documentary photograph",HLS06025.tif,"Yorkshire, UK",,,,,,,,,,,,,,,,,,,,,,,,,,,,,,,,,,,"Agriculture,Cottages,Hamlet",https://penninehorizons.org/files/original/2422d730740d3f7443e35767a820008f.jpg,"Still Image","Historic Homes of Yorkshire collection",1,0
7419,https://penninehorizons.org/items/show/7419,"Sprotbrough Mill and Cottage - HLS06026","Cottages, River","Slide 18 - Another photograph shows where 'Upon a promontory small, the water mill juts out' which bears on one of the gables the Arms of the Copley's dates 1653, and on the keystone of the doorway is the date 1748. Opposite the mill on the rivers bank is the Miller's cottage.","George Hepworth","Hebden Bridge Literary & Scientific Society","Pennine Horizons Digital Archive","1905 , 1900s","Hebden Bridge Local History Society","PHDA - Hebden Bridge Local History Society","Pennine Horizons Digital Archive","TIFF file 8-bit","English (U.K.)","Documentary photograph",HLS06026.tif,"Yorkshire, UK",,,,,,,,,,,,,,,,,,,,,,,,,,,,,,,,,,,"Cottages,River",https://penninehorizons.org/files/original/fa34ffed9b65c5d975b995f82a7b91e6.jpg,"Still Image","Historic Homes of Yorkshire collection",1,0
5731,https://penninehorizons.org/items/show/5731,"Hob Lane, Brearley, 1962 - HBC00785 ","Architecture, Brearley, Cottages, Hob Lane, Places, Sowerby",,"J. Uttley","Hebden Bridge Camera Club","Pennine Horizons Digital Archive",1960s,"Hebden Bridge Camera Club","PHDA - Hebden Bridge Camera Club","Pennine Horizons Digital Archive","TIFF file 8-bit","English (U.K.)","Documentary photograph",HBC00785.tif,,,,,,,,,,,,,,,,,,,,,,,,,,,,,,,,,,,,"1960s,Architecture,Brearley,Cottages,Hob Lane,Sowerby",https://penninehorizons.org/files/original/61ee5831f67cdd2c9bbfa6a891199fbd.jpg,"Still Image","Hebden Bridge Camera Club - The Changing Face of Hebden Bridge",1,0
