﻿"Item Id","Item URI","Dublin Core:Title","Dublin Core:Subject","Dublin Core:Description","Dublin Core:Creator","Dublin Core:Source","Dublin Core:Publisher","Dublin Core:Date","Dublin Core:Contributor","Dublin Core:Rights","Dublin Core:Relation","Dublin Core:Format","Dublin Core:Language","Dublin Core:Type","Dublin Core:Identifier","Dublin Core:Coverage","Item Type Metadata:Lesson Plan Text","Item Type Metadata:Bibliography","Item Type Metadata:Biographical Text","Item Type Metadata:Occupation","Item Type Metadata:Death Date","Item Type Metadata:Birthplace","Item Type Metadata:Birth Date","Item Type Metadata:Participants","Item Type Metadata:Event Type","Item Type Metadata:URL","Item Type Metadata:Bit Rate/Frequency","Item Type Metadata:Interviewer","Item Type Metadata:Interviewee","Item Type Metadata:Location","Item Type Metadata:Transcription","Item Type Metadata:Local URL","Item Type Metadata:Original Format","Item Type Metadata:Physical Dimensions","Item Type Metadata:Duration","Item Type Metadata:Compression","Item Type Metadata:Producer","Item Type Metadata:Director","Item Type Metadata:Text","Item Type Metadata:Time Summary","Item Type Metadata:Email Body","Item Type Metadata:Subject Line","Item Type Metadata:From","Item Type Metadata:To","Item Type Metadata:CC","Item Type Metadata:BCC","Item Type Metadata:Number of Attachments","Item Type Metadata:Standards","Item Type Metadata:Objectives","Item Type Metadata:Materials",tags,file,itemType,collection,public,featured
33746,https://penninehorizons.org/items/show/33746,"""A pathway in the woods"", Hardcastle Crags, Hebden Bridge. - WMH00378","Hardcastle Crags, Hebden Bridge, Paths & Tracks, Pathway, walkers","Undated postcard. The path seen here drops down from the Drive a few hundred metres beyond Gibson Mill to a bridge over Hebden Water and the river path back to Gibson Mill.","Lilywhite Ltd. Brighouse.","Pennine Horizons Digital Archive","Pennine Horizons Digital Archive",,"William Henwood","PHDA - William Henwood Collection","Pennine Horizons Digital Archive","TIFF file 8-bit","English (U.K.)","Documentary photograph",WMH00378.tif,,,,,,,,,,,,,,,,,,,,,,,,,,,,,,,,,,,,"Hardcastle Crags,Hebden Bridge,Paths & Tracks,Pathway,walkers",https://penninehorizons.org/files/original/332fb3e5bdb6b3ab5cb77d1acc1c3f64.jpg,"Still Image","William Henwood collection",1,0
22538,https://penninehorizons.org/items/show/22538,"100 Yards, 1974 - TNC00243","Paths & Tracks, Todmorden",,"Thomas Newell","Thomas Newell","Pennine Horizons Digital Archive","1974, 1970s","Thomas Newell, Box 2","PHDA - Thomas Newell Collection","Pennine Horizons Digital Archive","TIFF file 8-bit","English (U.K.)","Documentary photograph",TNC00243.tif,,,,,,,,,,,,,,,,,,,,,,,,,,,,,,,,,,,,"Paths & Tracks,Todmorden",https://penninehorizons.org/files/original/322f44a1977fd9f860fda97b623b88cf.jpg,"Still Image","Thomas Newell collection",1,0
10452,https://penninehorizons.org/items/show/10452,"A Pack-horse Train - MOT00124","Arts & Crafts, Colour, Packhorse, Packhorse route, Painting, Paths & Tracks, People at Work","A painting by Alfred Bayes, the Lumbutts-born artist, depicts a packhorse train travelling along the moorland causey stones, which still exist in many places today. The horses, led by a drover, were disciplined to follow the sound of bells fastened to the harness of the leading horse. Each horse carried 120lbs of cargo in his packs.","Alfred Bayes","Todmorden Information Centre Trust","Pennine Horizons Digital Archive","No date yet","Todmorden Information Centre Trust","PHDA - Todmorden Information Centre Trust","Pennine Horizons Digital Archive","TIFF file 8-bit","English (U.K.)","Documentary photograph",MOT00124.tif,Todmorden,,,,,,,,,,,,,,,,,,,,,,,,,,,,,,,,,,,"Arts and Crafts,Colour,Horse,Packhorse,Packhorse route,Painting,Paths & Tracks,People at Work",https://penninehorizons.org/files/original/d419ab68f2a601ee59c557fad31f2c58.jpg,"Still Image","The Making of Todmorden exhibition",1,0
8583,https://penninehorizons.org/items/show/8583,"A Valley Walk - JSB00168","Feature, Forest, Landscape, Paths & Tracks, Woodland, Woodlands, Woods",,"Possibly Nora Walton","Pennine Horizons Digital Archive","Pennine Horizons Digital Archive","No date yet","Steven Brook","PHDA - Steven Brook Collection","Pennine Horizons Digital Archive","TIFF file 8-bit","English (U.K.)","Documentary photograph",JSB00168.tif,,,,,,,,,,,,,,,,,,,,,,,,,,,,,,,,,,,,"Feature,Forest,Landscape,Paths & Tracks,Woodland,Woodlands,Woods",https://penninehorizons.org/files/original/901849e2ed076dfe75c19de7f7a83b46.jpg,"Still Image","Steven Brook collection",1,0
10453,https://penninehorizons.org/items/show/10453,"A view of Naze Road from Watty  Lane, off Bacup Road - MOT00125","Canal, Canal basin, Canals, Packhorse route, Paths & Tracks, Places, Todmorden, Transport","This is a good example of an upland route taken by packhorses in the years prior to the construction of the turnpike roads and canal.","Roger Birch","Todmorden Information Centre Trust","Pennine Horizons Digital Archive","1982, 1980s","Todmorden Information Centre Trust","PHDA - Todmorden Information Centre Trust","Pennine Horizons Digital Archive","TIFF file 8-bit","English (U.K.)","Documentary photograph",MOT00125.tif,Todmorden,,,,,,,,,,,,,,,,,,,,,,,,,,,,,,,,,,,"Canal,Canal basin,Packhorse route,Paths & Tracks,Todmorden,Transport",https://penninehorizons.org/files/original/bad3dbd6d08906aed2897e5c25122540.jpg,"Still Image","The Making of Todmorden exhibition",1,0
22610,https://penninehorizons.org/items/show/22610,"Above Walsden 1981  - TNC00315.tif","Derelict, Moorland, Paths & Tracks, Walsden, walkers","Walking Group on moors near a derelict farm.","Thomas Newell","Thomas Newell","Pennine Horizons Digital Archive","1981, 1980s",,"PHDA - Thomas Newell Collection","Pennine Horizons Digital Archive","TIFF file 8-bit","English (U.K.)","Documentary photograph",TNC00315.tif,,,,,,,,,,,,,,,,,,,,,,,,,,,,,,,,,,,,"Derelict,Moorland,Paths & Tracks,walkers,Walsden",https://penninehorizons.org/files/original/8bb34c15d25455db6c2a1e5131c557fe.jpg,"Still Image","Thomas Newell collection",1,0
18933,https://penninehorizons.org/items/show/18933,"An Early Morning Walk - NAO00194","Feature, Forest, Landscape, Paths & Tracks, Woodland, Woodlands, Woods",,"Naomi Chaunce","Pennine Horizons Digital Archive","Pennine Horizons Digital Archive","2010s, 2014-10-31T12:20:44","Naomi Chaunce","PHDA - Naomi Caunce","Pennine Horizons Digital Archive","TIFF file 8-bit","English (U.K.)","Documentary photograph",NAO00194.tif,,,,,,,,,,,,,,,,,,,,,,,,,,,,,,,,,,,,"Feature,Forest,Landscape,Paths & Tracks,Woodland,Woodlands,Woods",https://penninehorizons.org/files/original/3d2915df045d15add18b52757f6e701a.jpg,"Still Image","Naomi Caunce collection",1,0
36957,https://penninehorizons.org/items/show/36957,"Arches in Centre Vale Park, Todmorden - TAS01472","Arches, Centre Vale, Feature, Forest, Landscape, Munition, Park, Paths & Tracks, Places, Todmorden, Woodland, Woodlands, Woods","Carr Laithe Barn, demolished in the 1930s, was built on top of the 'tunnels', which were used as a munition stores in WW2.",,,"Pennine Horizons Digital Archive",2014-09-30T20:19:08,,"PHDA - Todmorden Antiquarian Society","Pennine Horizons Digital Archive","TIFF file 8-bit","English (U.K.)","Documentary photograph",TAS01472.jpg,,,,,,,,,,,,,,,,,,,,,,,,,,,,,,,,,,,,"Arches,Centre Vale,Feature,Forest,Landscape,Munition,Park,Paths & Tracks,Places,Todmorden,Woodland,Woodlands,Woods",https://penninehorizons.org/files/original/74ad314b7a69dfc89e5b859fb156e959.jpg,"Still Image","Todmorden General",1,0
4571,https://penninehorizons.org/items/show/4571,"Autumn Gold - Hardcastle Crags - DMC00299","Autumn, Hardcastle Crags, Landscape, Leaves, National Trust, October, Paths & Tracks, Places, Road, Seasons, Trees","Track through Hardcastle Crags, Hebden Bridge","David Martin","Pennine Horizons Digital Archive","Pennine Horizons Digital Archive","No date yet","David Martin","PHDA - David Martin Collection","Pennine Horizons Digital Archive","TIFF file 8-bit","English (U.K.)","Documentary photograph",DMC00299.TIF,",  ",,,,,,,,,,,,,,,,,,,,,,,,,,,,,,,,,,,"Autumn,Hardcastle Crags,Landscape,Leaves,National Trust,October,Paths & Tracks,Road,Seasons,Trees",https://penninehorizons.org/files/original/06e41e22a4879344ba702dbada52f8d4.jpg,"Still Image","David's Own Pictures",1,0
22502,https://penninehorizons.org/items/show/22502,"Bacup Road, Todmorden, 1973 - TNC00206","Feature, Forest, Landscape, Paths & Tracks, Todmorden, Woodland, Woodlands, Woods",,"Thomas Newell","Thomas Newell","Pennine Horizons Digital Archive","1973, 1970s",,"PHDA - Thomas Newell Collection","Pennine Horizons Digital Archive","TIFF file 8-bit","English (U.K.)","Documentary photograph",TNC00206.tif,,,,,,,,,,,,,,,,,,,,,,,,,,,,,,,,,,,,"Feature,Forest,Landscape,Paths & Tracks,Todmorden,Woodland,Woodlands,Woods",https://penninehorizons.org/files/original/d1a18263be32233356563ac6efb81a09.jpg,"Still Image","Thomas Newell collection",1,0
20130,https://penninehorizons.org/items/show/20130,"Bankside, Hebden Bridge. - KEC00334","Bankside, Cliffe Street, Hebden Bridge, Packhorse route, Paths & Tracks, Street Names","The houses on the left front onto Cliffe Street and above the wall on the right the roof of Stubbings School. The path is the remains of the old packhorse road between Heptonstall and Halifax from which a branch ran up to Old Town and on to Haworth. Part of the Hebden Bridge Local History Society Archive","Kenneth Crabtree","Pennine Horizons Digital Archive","Pennine Horizons Digital Archive","No date yet","Hebden Bridge Local History Society","PHDA - Hebden Bridge Local History Society","Pennine Horizons Digital Archive","TIFF file 8-bit","English (U.K.)","Documentary photograph",KEC00334.tif,"Hebden Bridge",,,,,,,,,,,,,,,,,,,,,,,,,,,,,,,,,,,"Bankside,Cliffe Street,Hebden Bridge,Packhorse route,Paths & Tracks,Street Names",https://penninehorizons.org/files/original/faf6c3ca4ae6dfcd23aaf88f55e76973.jpg,"Still Image","Ken Crabtree Collection",1,0
20690,https://penninehorizons.org/items/show/20690,"Bankside, Hebden Bridge. - WSC00106","Cobbles, Hebden Bridge, Packhorse route, Paths & Tracks, Townscape","This cobbled path, known locally as the Snicket, was part of the Heptonstall – Halifax packhorse route and originally dropped sharply straight down, passing the front of the White Lion to the Old Bridge and on to the Buttress. Houses on the left are the rear of Cliffe Street. Slightly left of centre is the landmark Calder Mill chimney. The low wall on the right surrounds an electricity sub-station.
","W. Shepherd","Pennine Horizons Digital Archive","Pennine Horizons Digital Archive","No date yet","W. Shepherd","PHDA - W. Shepherd Collection","Pennine Horizons Digital Archive","TIFF file 8-bit","English (U.K.)","Documentary photograph",WSC00106.tif,,,,,,,,,,,,,,,,,,,,,,,,,,,,,,,,,,,,"Cobbles,Hebden Bridge,Packhorse route,Paths & Tracks,Townscape",https://penninehorizons.org/files/original/265baacbaceadfc3f9aa9b88ea4bdd2f.jpg,"Still Image","W. Shepherd collection",1,0
37223,https://penninehorizons.org/items/show/37223,"Blackstone Edge - RAC1957.068.1","Blackstone_Edge, Paths & Tracks",,,,"Pennine Horizons Digital Archive",1957,,"PHDA - Ralph Cross Collection","Pennine Horizons Digital Archive","TIFF file 8-bit","English (U.K.)","Documentary photograph",RAC1957.068.1.jpg,,,,,,,,,,,,,,,,,,,,,,,,,,,,,,,,,,,,"Blackstone_Edge,Paths & Tracks",https://penninehorizons.org/files/original/3bfcaac683b296efaf4b537df05533ba.jpg,"Still Image","Ralph Cross 1957",1,0
37224,https://penninehorizons.org/items/show/37224,"Blackstone Edge - RAC1957.068.2","Blackstone_Edge, Hollingworth Lake, Paths & Tracks","Looking towards Littleborough with Hollingworth Lake to the left of the picture. This track is known as the Roman Road.",,,"Pennine Horizons Digital Archive",1957,,"PHDA - Ralph Cross Collection","Pennine Horizons Digital Archive","TIFF file 8-bit","English (U.K.)","Documentary photograph",RAC1957.068.2.jpg,,,,,,,,,,,,,,,,,,,,,,,,,,,,,,,,,,,,"Blackstone_Edge,Hollingworth Lake,Paths & Tracks",https://penninehorizons.org/files/original/5a8f597d9b2d6f628e4dd423ad95204f.jpg,"Still Image","Ralph Cross 1957",1,0
37225,https://penninehorizons.org/items/show/37225,"Blackstone Edge - RAC1957.068.3","Blackstone_Edge, Paths & Tracks",,,,"Pennine Horizons Digital Archive",1957,,"PHDA - Ralph Cross Collection","Pennine Horizons Digital Archive","TIFF file 8-bit","English (U.K.)","Documentary photograph",RAC1957.068.3.jpg,,,,,,,,,,,,,,,,,,,,,,,,,,,,,,,,,,,,"Blackstone_Edge,Paths & Tracks",https://penninehorizons.org/files/original/5b468d41d4fb296db4c86c1db94774e3.jpg,"Still Image","Ralph Cross 1957",1,0
37226,https://penninehorizons.org/items/show/37226,"Blackstone Edge - RAC1957.068.4","Blackstone_Edge, Paths & Tracks",,,,"Pennine Horizons Digital Archive",1957,,"PHDA - Ralph Cross Collection","Pennine Horizons Digital Archive","TIFF file 8-bit","English (U.K.)","Documentary photograph",RAC1957.068.4.jpg,,,,,,,,,,,,,,,,,,,,,,,,,,,,,,,,,,,,"Blackstone_Edge,Paths & Tracks",https://penninehorizons.org/files/original/c00f9cf6dfe8bf894109348a3b1f50b7.jpg,"Still Image","Ralph Cross 1957",1,0
28150,https://penninehorizons.org/items/show/28150,"Blake Dean - KST00609","Blake Dean, Paths & Tracks, Places","Causey at the meeting of the waters, between Heptonstall and Colne","Ken Stott",,"Pennine Horizons Digital Archive",,,"PHDA - Ken Stott Collection","Pennine Horizons Digital Archive","TIFF file 8-bit","English (U.K.)","Documentary photograph",KST00609.tif,,,,,,,,,,,,,,,,,,,,,,,,,,,,,,,,,,,,"Blake Dean,Paths & Tracks,Places",https://penninehorizons.org/files/original/304c73d9ebf6c1116998cefd44b96c37.jpg,"Still Image","Ken Stott Collection",1,0
8870,https://penninehorizons.org/items/show/8870,"Blind Lane, Brearley - KES00123","Blind Lane, Brearley, Landscape, Paths & Tracks, Places","Upper Blind Lane, leading to Upper Blind Lane Farm.","Keith Stansfield","Pennine Horizons Digital Archive","Pennine Horizons Digital Archive",2006-04-05T14:03:09,"Keith Stansfield","PHDA - Keith Stansfield Collection","Pennine Horizons Digital Archive","TIFF file 8-bit","English (U.K.)","Documentary photograph",KES00123.tif,,,,,,,,,,,,,,,,,,,,,,,,,,,,,,,,,,,,"Blind Lane,Brearley,Landscape,Paths & Tracks",https://penninehorizons.org/files/original/c098c97b8267cfb9d10ad666d9a46a8c.jpg,"Still Image","Keith Stansfield collection",1,0
8877,https://penninehorizons.org/items/show/8877,"Blind Lane, Brearley - KES00126","Architecture, Blind Lane, Brearley, Paths & Tracks, Places","Grade II listed properties at Nos. 10 & 12 Blind Lane, Brearley.","Keith Stansfield","Pennine Horizons Digital Archive","Pennine Horizons Digital Archive",2006-04-05T14:09:21,"Keith Stansfield","PHDA - Keith Stansfield Collection","Pennine Horizons Digital Archive","TIFF file 8-bit","English (U.K.)","Documentary photograph",KES00126.tif,,,,,,,,,,,,,,,,,,,,,,,,,,,,,,,,,,,,"Architecture,Blind Lane,Brearley,Paths & Tracks",https://penninehorizons.org/files/original/4c2def8ce046c5bd298164eb4a5ce743.jpg,"Still Image","Keith Stansfield collection",1,0
4729,https://penninehorizons.org/items/show/4729,"Bluebells in Hardcastle Crags - DMC00456","Bluebells, Footpath, National Trust, Paths & Tracks",,"David Martin","Pennine Horizons Digital Archive","Pennine Horizons Digital Archive",2003-05-06T14:11:14+01:00,"David Martin","PHDA - David Martin Collection","Pennine Horizons Digital Archive","TIFF file 8-bit","English (U.K.)","Documentary photograph",DMC00456.tif,",53°45'32"" N 2°1'57"" W",,,,,,,,,,,,,,,,,,,,,,,,,,,,,,,,,,,"Bluebells,Footpath,National Trust,Paths & Tracks",https://penninehorizons.org/files/original/208f19afcb031c755054c8d46892a65b.jpg,"Still Image","David's Own Pictures",1,0
4572,https://penninehorizons.org/items/show/4572,"Bluebells in the Hardcastle Crags - DMC00300","Bluebells, Landscape, Paths & Tracks, Places, Seasons, Spring","Hebden Bridge","David Martin","Pennine Horizons Digital Archive","Pennine Horizons Digital Archive","No date yet","David Martin","PHDA - David Martin Collection","Pennine Horizons Digital Archive","TIFF file 8-bit","English (U.K.)","Documentary photograph",DMC00300.TIF,",  ",,,,,,,,,,,,,,,,,,,,,,,,,,,,,,,,,,,"Bluebells,Landscape,Paths & Tracks,Seasons,Spring",https://penninehorizons.org/files/original/03663b720d35257ee389882297cf4a92.jpg,"Still Image","David's Own Pictures",1,0
7175,https://penninehorizons.org/items/show/7175,"Boat House on Lake at Chevet Park - HLS05779","Architecture, Boathouse, Feature, Forest, Lake, Landscape, Paths & Tracks, Woodland, Woodlands, Woods","Slide 5 - The lake is nearly a mile in length and is the resort of numerous water fowl of various species, and these are carefully protected by the owner of the estate.  A boat house on the margin of the lake forms rather a picturesque object.","George Hepworth","Hebden Bridge Literary & Scientific Society","Pennine Horizons Digital Archive","1905 , 1900s","Hebden Bridge Local History Society","PHDA - Hebden Bridge Local History Society","Pennine Horizons Digital Archive","TIFF file 8-bit","English (U.K.)","Documentary photograph",HLS05779.tif,"Yorkshire, UK",,,,,,,,,,,,,,,,,,,,,,,,,,,,,,,,,,,"Architecture,Boathouse,Feature,Forest,Lake,Landscape,Paths & Tracks,Woodland,Woodlands,Woods",https://penninehorizons.org/files/original/0fee88fc5c6121b33df6fbc09c1edd28.jpg,"Still Image","Historic Homes of Yorkshire collection",1,0
5903,https://penninehorizons.org/items/show/5903,"Brier Hey Swing Bridge, Mytholmroyd, 1962 - HBC00963 ","Bridge, Mytholmroyd, Paths & Tracks","The bridge is over the Rochdale Canal. Southfield House is to the right of the picture.","J. Woodhead","Hebden Bridge Camera Club","Pennine Horizons Digital Archive",1960s,"Hebden Bridge Camera Club","PHDA - Hebden Bridge Camera Club","Pennine Horizons Digital Archive","TIFF file 8-bit","English (U.K.)","Documentary photograph",HBC00963.tif,,,,,,,,,,,,,,,,,,,,,,,,,,,,,,,,,,,,"1960s,Bridge,Mytholmroyd,Paths & Tracks",https://penninehorizons.org/files/original/70b6fc2bd45dbd1812c314412f0da61d.jpg,"Still Image","Hebden Bridge Camera Club - The Changing Face of Hebden Bridge",1,0
5904,https://penninehorizons.org/items/show/5904,"Brier Hey Swing Bridge, Mytholmroyd, 1962 - HBC00964 ","Bridge, Canal, Canals, Motor Scooter, Mytholmroyd, Paths & Tracks, Places, Transport",,"J. Woodhead","Hebden Bridge Camera Club","Pennine Horizons Digital Archive",1960s,"Hebden Bridge Camera Club","PHDA - Hebden Bridge Camera Club","Pennine Horizons Digital Archive","TIFF file 8-bit","English (U.K.)","Documentary photograph",HBC00964.tif,,,,,,,,,,,,,,,,,,,,,,,,,,,,,,,,,,,,"1960s,Bridge,Canal,Motor Scooter,Mytholmroyd,Paths & Tracks,Transport",https://penninehorizons.org/files/original/0ec16f7606542c8f50494c2da0ca1dc2.jpg,"Still Image","Hebden Bridge Camera Club - The Changing Face of Hebden Bridge",1,0
40837,https://penninehorizons.org/items/show/40837,"Broad Ing Top, Cross Stone, Todmorden - RAC1960.088","Barn, Paths & Tracks, Vernacular_architecture, cottage^^Vernacular Architecture",,"Ralph Cross",,"Pennine Horizons Digital Archive",1960,,"PHDA - -Ralph Cross Collection","Pennine Horizons Digital Archive","TIFF file 8-bit","English (U.K.)","Documentary photograph",RAC1960.088.jpg,,,,,,,,,,,,,,,,,,,,,,,,,,,,,,,,,,,,"Barn,cottage,Paths & Tracks,Vernacular_architecture",https://penninehorizons.org/files/original/1991922832361f0b889a2bcc7fc288c6.jpg,"Still Image","Ralph Cross 1960",1,0
