﻿"Item Id","Item URI","Dublin Core:Title","Dublin Core:Subject","Dublin Core:Description","Dublin Core:Creator","Dublin Core:Source","Dublin Core:Publisher","Dublin Core:Date","Dublin Core:Contributor","Dublin Core:Rights","Dublin Core:Relation","Dublin Core:Format","Dublin Core:Language","Dublin Core:Type","Dublin Core:Identifier","Dublin Core:Coverage","Item Type Metadata:Lesson Plan Text","Item Type Metadata:Bibliography","Item Type Metadata:Biographical Text","Item Type Metadata:Occupation","Item Type Metadata:Death Date","Item Type Metadata:Birthplace","Item Type Metadata:Birth Date","Item Type Metadata:Participants","Item Type Metadata:Event Type","Item Type Metadata:URL","Item Type Metadata:Bit Rate/Frequency","Item Type Metadata:Interviewer","Item Type Metadata:Interviewee","Item Type Metadata:Location","Item Type Metadata:Transcription","Item Type Metadata:Local URL","Item Type Metadata:Original Format","Item Type Metadata:Physical Dimensions","Item Type Metadata:Duration","Item Type Metadata:Compression","Item Type Metadata:Producer","Item Type Metadata:Director","Item Type Metadata:Text","Item Type Metadata:Time Summary","Item Type Metadata:Email Body","Item Type Metadata:Subject Line","Item Type Metadata:From","Item Type Metadata:To","Item Type Metadata:CC","Item Type Metadata:BCC","Item Type Metadata:Number of Attachments","Item Type Metadata:Standards","Item Type Metadata:Objectives","Item Type Metadata:Materials",tags,file,itemType,collection,public,featured
226,https://penninehorizons.org/items/show/226,"Croft Yard, Hebden Bridge - AGW00145","Buildings, Car park, Garden Street, Hebden Bridge, Mill, Mills, Places, Road, Street Names, Transport",,"Alan Greenwood","Alan Greenwood","Pennine Horizons Digital Archive","2007-08-23T15:00:53+01:00 , 2000s","Alan Greenwood","PHDA - Alan Greenwood Collection","Pennine Horizons Digital Archive","TIFF file 8-bit","English (U.K.)","Documentary photograph",AGW00145.tif,"Hebden Bridge",,,,,,,,,,,,,,,,,,,,,,,,,,,,,,,,,,,"Buildings,Car park,Garden Street,Hebden Bridge,Mill,Mills,Road,Street Names,Transport",https://penninehorizons.org/files/original/6a5c4e023fbe4597a0a635c9b20bca38.jpg,"Still Image","Alan Greenwood Collection",1,0
227,https://penninehorizons.org/items/show/227,"Garden Street Car Park, Hebden Bridge - AGW00146","Buildings, Car park, Garden Street, Hebden Bridge, Mill, Mills, Places, Road, Street Names, Transport",,"Alan Greenwood","Alan Greenwood","Pennine Horizons Digital Archive","2007-08-23T15:02:23+01:00 , 2000s","Alan Greenwood","PHDA - Alan Greenwood Collection","Pennine Horizons Digital Archive","TIFF file 8-bit","English (U.K.)","Documentary photograph",AGW00146.tif,"Hebden Bridge",,,,,,,,,,,,,,,,,,,,,,,,,,,,,,,,,,,"Buildings,Car park,Garden Street,Hebden Bridge,Mill,Mills,Road,Street Names,Transport",https://penninehorizons.org/files/original/a9b25fd91720cdaf8b5b623c0d2ec428.jpg,"Still Image","Alan Greenwood Collection",1,0
228,https://penninehorizons.org/items/show/228,"Garden Street Car Park, Hebden Bridge - AGW00147","Buildings, Car park, Chimney, Chimneys, Garden Street, Hebden Bridge, Mill, Mills, Places, Road, Street Names, Transport",,"Alan Greenwood","Alan Greenwood","Pennine Horizons Digital Archive","2007-08-23T15:04:32+01:00 , 2000s","Alan Greenwood","PHDA - Alan Greenwood Collection","Pennine Horizons Digital Archive","TIFF file 8-bit","English (U.K.)","Documentary photograph",AGW00147.tif,"Hebden Bridge",,,,,,,,,,,,,,,,,,,,,,,,,,,,,,,,,,,"Buildings,Car park,Chimney,Chimneys,Garden Street,Hebden Bridge,Mill,Mills,Road,Street Names,Transport",https://penninehorizons.org/files/original/f1f229ac589743f22a1c2309394e59f7.jpg,"Still Image","Alan Greenwood Collection",1,0
236,https://penninehorizons.org/items/show/236,"Council Offices, Hebden Bridge - AGW00155","Buildings, Car park, Council Offices, Hebden Bridge, Inn, Places, Public Houses, Pubs Inns & Hotels, Road, Shoulder of Mutton, Taverns, Transport",,"Alan Greenwood","Alan Greenwood","Pennine Horizons Digital Archive","2007-08-26T10:04:58+01:00 , 2000s","Alan Greenwood","PHDA - Alan Greenwood Collection","Pennine Horizons Digital Archive","TIFF file 8-bit","English (U.K.)","Documentary photograph",AGW00155.tif,"Hebden Bridge",,,,,,,,,,,,,,,,,,,,,,,,,,,,,,,,,,,"Buildings,Car park,Council Offices,Hebden Bridge,Public Houses,Pubs Inns and Hotels,Road,Town Hall,Transport",https://penninehorizons.org/files/original/5927d398f211366bc41b2a7e0df38b2c.jpg,"Still Image","Alan Greenwood Collection",1,0
274,https://penninehorizons.org/items/show/274,"Valley Road, Hebden Bridge - AGW00193","Buildings, Car park, Hebden Bridge, Places, Retail, Road, Shop, Shops, Transport","Taken from the Council Chamber","Alan Greenwood","Alan Greenwood","Pennine Horizons Digital Archive",2012-10-13T10:48:12,"Alan Greenwood","PHDA - Alan Greenwood Collection","Pennine Horizons Digital Archive","TIFF file 8-bit","English (U.K.)","Documentary photograph",AGW00193.TIF,"Hebden Bridge",,,,,,,,,,,,,,,,,,,,,,,,,,,,,,,,,,,"Buildings,Car park,Hebden Bridge,Retail,Road,Shop,Shops,Transport",https://penninehorizons.org/files/original/ffb200ec74312317e7e0b1ce266b1d97.jpg,"Still Image","Alan Greenwood Collection",1,0
275,https://penninehorizons.org/items/show/275,"Valley Road, Hebden Bridge - AGW00194","Buildings, Car park, Hebden Bridge, Places, Retail, Road, Shop, Shops, Transport",,"Alan Greenwood","Alan Greenwood","Pennine Horizons Digital Archive",2012-10-13T10:48:29,"Alan Greenwood","PHDA - Alan Greenwood Collection","Pennine Horizons Digital Archive","TIFF file 8-bit","English (U.K.)","Documentary photograph",AGW00194.TIF,"Hebden Bridge",,,,,,,,,,,,,,,,,,,,,,,,,,,,,,,,,,,"Buildings,Car park,Hebden Bridge,Retail,Road,Shop,Shops,Transport",https://penninehorizons.org/files/original/7ec738c8f26a78c4225ef7a2537b9321.jpg,"Still Image","Alan Greenwood Collection",1,0
3499,https://penninehorizons.org/items/show/3499,"Smithwell Lane, Heptonstall - DTA00149","Bus, Heptonstall, Places, Road, School, Smithwell Lane, Street Names, Transport","Bus in Heptonstall.","Donald Taylor","Pennine Horizons Digital Archive","Pennine Horizons Digital Archive","No date yet","Donald Taylor","PHDA - Donald Taylor Collection","Pennine Horizons Digital Archive","TIFF file 8-bit","English (U.K.)","Documentary photograph",DTA00149.tif,Heptonstall,,,,,,,,,,,,,,,,,,,,,,,,,,,,,,,,,,,"Bus,Heptonstall,Road,School,Smithwell Lane,Street Names,Transport",https://penninehorizons.org/files/original/8f2c541c2201427091338c8d75d0671a.jpg,"Still Image","Donald Taylor collection",1,0
4309,https://penninehorizons.org/items/show/4309,"Clegg Nook, Cragg Road, Mytholmroyd - GMA00102","Bicycle, Boy, Boys, Child, Children, Chimney, Chimneys, Clegg Nook, Girl, Girls, Horse & Cart, Inn, Kid, Motorcycle, Motorcycle sidecar, Mytholmroyd, People, Places, Railway, Railway station, Railways, Road, Toddler, Transport","Clegg Nook, Mytholmroyd. Used as an illustration in Gertrude Attwood's book ""A Village Childhood""",,"Pennine Horizons Digital Archive","Pennine Horizons Digital Archive","No date yet","Gertrude Attwood","PHDA - Gertrude Attwood Collection","Pennine Horizons Digital Archive","TIFF file 8-bit","English (U.K.)","Documentary photograph",GMA00102.tif,,,,,,,,,,,,,,,,,,,,,,,,,,,,,,,,,,,,"Bicycle,Boy,Child,Children,Chimney,Chimneys,Clegg Nook,Girl,Girls,Horse & Cart,Inn,Kid,Motorcycle,Motorcycle sidecar,Mytholmroyd,People,Railway,Railway station,Railways,Road,Toddler,Transport",https://penninehorizons.org/files/original/7ccedda44967f1fac4d1423e9fb37579.jpg,"Still Image","Gertrude Attwood collection",1,0
4571,https://penninehorizons.org/items/show/4571,"Autumn Gold - Hardcastle Crags - DMC00299","Autumn, Hardcastle Crags, Landscape, Leaves, National Trust, October, Paths & Tracks, Places, Road, Seasons, Trees","Track through Hardcastle Crags, Hebden Bridge","David Martin","Pennine Horizons Digital Archive","Pennine Horizons Digital Archive","No date yet","David Martin","PHDA - David Martin Collection","Pennine Horizons Digital Archive","TIFF file 8-bit","English (U.K.)","Documentary photograph",DMC00299.TIF,",  ",,,,,,,,,,,,,,,,,,,,,,,,,,,,,,,,,,,"Autumn,Hardcastle Crags,Landscape,Leaves,National Trust,October,Paths & Tracks,Road,Seasons,Trees",https://penninehorizons.org/files/original/06e41e22a4879344ba702dbada52f8d4.jpg,"Still Image","David's Own Pictures",1,0
5183,https://penninehorizons.org/items/show/5183,"Charlie Crabtree's, Todmorden - DEP00360","LMS, Mill, Railway, Railways, Road, Todmorden, Transport","The wagon is dressed up for the Silver Jubilee of King George V and Queen Mary in May 1935.

Percy Pollard, in flat cap, was the steam engine tenter. The wagon would be loaded with calico made at 'Old Charlie's Crabtree's'",Unknown,"Pennine Horizons Digital Archive","Pennine Horizons Digital Archive",1930s,"Derek Pollard","PHDA - Derek Pollard Collection","Pennine Horizons Digital Archive","TIFF file 8-bit","English (U.K.)","Documentary photograph",DEP00360.tif,Todmorden,,,,,,,,,,,,,,,,,,,,,,,,,,,,,,,,,,,"LMS,Mill,Railway,Railways,Road,Todmorden,Transport",https://penninehorizons.org/files/original/4ea5fad3a24814b4739e2e9c78a1d98d.jpg,"Still Image","Derek Pollard collection",1,0
5467,https://penninehorizons.org/items/show/5467,"Stubbing Wharf Bridge - HBC00522 ","Bridge, Bus, Chimney, Chimneys, Hebden Bridge, Mytholm, River, Road, Stubbing Holme, Transport","Mytholm, 1962.","W. Brown","Hebden Bridge Camera Club","Pennine Horizons Digital Archive","No date yet","Hebden Bridge Camera Club","PHDA - Hebden Bridge Camera Club","Pennine Horizons Digital Archive","TIFF file 8-bit","English (U.K.)","Documentary photograph",HBC00522.tif,,,,,,,,,,,,,,,,,,,,,,,,,,,,,,,,,,,,"Bridge,Bus,Chimney,Chimneys,Hebden Bridge,Mytholm,River,Road,Stubbing Holme,Transport",https://penninehorizons.org/files/original/8346a734900641940c7089c38593abf9.jpg,"Still Image","Hebden Bridge Camera Club - The Changing Face of Hebden Bridge",1,0
5535,https://penninehorizons.org/items/show/5535,"Chapel Avenue, Birchcliffe, Hebden Bridge, June 1978 - HBC00590 ","Birchcliffe, Cars, Chapel Avenue, Hebden Bridge, Places, Road, Street Names, Transport",,"E. Carr","Hebden Bridge Camera Club","Pennine Horizons Digital Archive",1970s,"Hebden Bridge Camera Club","PHDA - Hebden Bridge Camera Club","Pennine Horizons Digital Archive","TIFF file 8-bit","English (U.K.)","Documentary photograph",HBC00590.tif,,,,,,,,,,,,,,,,,,,,,,,,,,,,,,,,,,,,"Birchcliffe,Cars,Chapel Avenue,Hebden Bridge,Road,Street Names,Transport",https://penninehorizons.org/files/original/44917257bd40c8a01ed39302da094a23.jpg,"Still Image","Hebden Bridge Camera Club - The Changing Face of Hebden Bridge",1,0
5546,https://penninehorizons.org/items/show/5546,"Buttress Brink, Hebden Bridge, August 1961 - HBC00600 ","Bicycle, Buttress, Flag stones, Hebden Bridge, Places, Road, Street Names, Transport, Washing Line","A view from the top.","W. Brown","Hebden Bridge Camera Club","Pennine Horizons Digital Archive",1960s,"Hebden Bridge Camera Club","PHDA - Hebden Bridge Camera Club","Pennine Horizons Digital Archive","TIFF file 8-bit","English (U.K.)","Documentary photograph",HBC00600.tif,,,,,,,,,,,,,,,,,,,,,,,,,,,,,,,,,,,,"1960s,Bicycle,Buttress,Flag stones,Hebden Bridge,Road,Street Names,Transport,Washing Line",https://penninehorizons.org/files/original/d36180c5e676fc93b4441b4bda31dbfd.jpg,"Still Image","Hebden Bridge Camera Club - The Changing Face of Hebden Bridge",1,0
5670,https://penninehorizons.org/items/show/5670,"Hebden Bridge Station, 1962. - HBC00724 ","Hebden Bridge, Railway, Railway station, Railways, Road","The arch under the tracks coming down from Palace House Road, the road in much better condition than it is today.","C.L. Shaw","Hebden Bridge Camera Club","Pennine Horizons Digital Archive",1960s,"Hebden Bridge Camera Club","PHDA - Hebden Bridge Camera Club","Pennine Horizons Digital Archive","TIFF file 8-bit","English (U.K.)","Documentary photograph",HBC00724.tif,,,,,,,,,,,,,,,,,,,,,,,,,,,,,,,,,,,,"1960s,Hebden Bridge,Railway,Railway station,Railways,Road",https://penninehorizons.org/files/original/3ba0dadc921109865ad3629f3f345b8d.jpg,"Still Image","Hebden Bridge Camera Club - The Changing Face of Hebden Bridge",1,0
5790,https://penninehorizons.org/items/show/5790,"Fallingroyd Bridge, 1962 - HBC00844 ","Bridge, Bus, Canal, Canals, Road, Tow Path, Transport",,"J. Woodhead","Hebden Bridge Camera Club","Pennine Horizons Digital Archive",1960s,"Hebden Bridge Camera Club","PHDA - Hebden Bridge Camera Club","Pennine Horizons Digital Archive","TIFF file 8-bit","English (U.K.)","Documentary photograph",HBC00844.tif,,,,,,,,,,,,,,,,,,,,,,,,,,,,,,,,,,,,"1960s,Bridge,Bus,Canal,Road,Tow Path,Transport",https://penninehorizons.org/files/original/608d0b3c35f8d4e17bffb012c070e997.jpg,"Still Image","Hebden Bridge Camera Club - The Changing Face of Hebden Bridge",1,0
6049,https://penninehorizons.org/items/show/6049,"Floods at Mytholmroyd, September 1954 - HBC01108 ","Belisha Beacon, Bus, Floods, Mytholmroyd, Places, River, Road, Transport, Umbrella, Westfield Mill, telephone box","View across the main road from Caldene Avenue at approx 9 am when the water had just covered the road. The car was abandoned by the gentleman who took refuge on the house steps of the house, the car was eventually swept along as far as the New Road bridge.","R.H. Calvert","Hebden Bridge Camera Club","Pennine Horizons Digital Archive",1950s,"Hebden Bridge Camera Club","PHDA - Hebden Bridge Camera Club","Pennine Horizons Digital Archive","TIFF file 8-bit","English (U.K.)","Documentary photograph",HBC01108.tif,,,,,,,,,,,,,,,,,,,,,,,,,,,,,,,,,,,,"#Flood,1950s,Belisha Beacon,Bus,Floods,Mytholmroyd,River,Road,Telephone box,Transport,Umbrella,Westfield Mill",https://penninehorizons.org/files/original/50ab025061d1ef676432af85f41efb3b.jpg,"Still Image","Hebden Bridge Camera Club - The Changing Face of Hebden Bridge",1,0
6229,https://penninehorizons.org/items/show/6229,"Fallingroyd c.1952 - HLS00307","Bicycle, Fallingroyd, Hebden Bridge, Road, Transport","Hebden Royd U.D. Leeds-Halifax-Preston Trunk Road A646, Caldene Bridge-Bridge Gate Reconstruction Scheme. Falling Royd Hall entrance after reconstruction. Photo dated 28/4/52 looking towards Mytholmroyd.",,,,1950s,,"PHDA - Hebden Bridge Local History Society","Pennine Horizons Digital Archive","TIFF file 8-bit","English (U.K.)","Documentary photograph",HLS00307.tif,,,,,,,,,,,,,,,,,,,,,,,,,,,,,,,,,,,,"1950s,Bicycle,Fallingroyd,Hebden Bridge,Road,Transport",https://penninehorizons.org/files/original/d613db63a240634eebb104f166cc27df.jpg,"Still Image","Hebden Bridge Local History Society",1,0
6238,https://penninehorizons.org/items/show/6238,"New Road, Hebden Bridge 1951/52. - HLS00316","Buildings, Bus, Crossley Mill, Hebden Bridge, Mill, Mills, New Road, Retail, Road, Shop, Shops, Street Names, Transport","Hebden Royd U.D. Leeds-Halifax-Preston Trunk Road A646, Caldene Bridge-Bridge Gate Reconstruction Scheme. Improvement at Memorial Gardens, Hebden Bridge. 1951/52 Estimates. The bridge across New Road connected the two parts of Crossley Mill.",,,,1950s,,"PHDA - Hebden Bridge Local History Society","Pennine Horizons Digital Archive","TIFF file 8-bit","English (U.K.)","Documentary photograph",HLS00316.tif,,,,,,,,,,,,,,,,,,,,,,,,,,,,,,,,,,,,"1950s,Buildings,Bus,Crossley Mill,Hebden Bridge,Mill,Mills,New Road,Retail,Road,Shop,Shops,Street Names,Transport",https://penninehorizons.org/files/original/62312b8cfe970bc894ea438482faf147.jpg,"Still Image","Hebden Bridge Local History Society",1,0
6240,https://penninehorizons.org/items/show/6240,"New Road and West End, Hebden Bridge 1951. - HLS00318","Buildings, Bus, Hebden Bridge, New Road, Retail, Road, Shop, Shops, Street Names, Timothy Whites, Transport, West End","Hebden Royd U.D. Leeds-Halifax-Preston Trunk Road A646, Caldene Bridge-Bridge Gate Reconstruction Scheme. Improvement at Memorial Gardens, Hebden Bridge. 1951/52 Estimates.",,,,1950s,,"PHDA - Hebden Bridge Local History Society","Pennine Horizons Digital Archive","TIFF file 8-bit","English (U.K.)","Documentary photograph",HLS00318.tif,,,,,,,,,,,,,,,,,,,,,,,,,,,,,,,,,,,,"1950s,Buildings,Bus,Hebden Bridge,New Road,Retail,Road,Shop,Shops,Street Names,Timothy Whites,Transport,West End",https://penninehorizons.org/files/original/4d1ed6214292e704fdb835998fcf8105.jpg,"Still Image","Hebden Bridge Local History Society",1,0
6242,https://penninehorizons.org/items/show/6242,"New Road and West End, Hebden Bridge 1951. - HLS00320","Bicycle, Hebden Bridge, New Road, Queen's Terrace, Road, Street Names, Timothy Whites, Transport, West End","Hebden Royd U.D. Leeds-Halifax-Preston Trunk Road A646, Caldene Bridge-Bridge Gate Reconstruction Scheme. Improvement at Memorial Gardens, Hebden Bridge. 1951/52 Estimates. Looking towards Todmorden before improvement.",,,,1950s,,"PHDA - Hebden Bridge Local History Society","Pennine Horizons Digital Archive","TIFF file 8-bit","English (U.K.)","Documentary photograph",HLS00320.tif,,,,,,,,,,,,,,,,,,,,,,,,,,,,,,,,,,,,"1950s,Bicycle,Hebden Bridge,New Road,Queen's Terrace,Road,Street Names,Timothy Whites,Transport,West End",https://penninehorizons.org/files/original/d7636e721e8266953e79a24183df1a5b.jpg,"Still Image","Hebden Bridge Local History Society",1,0
6380,https://penninehorizons.org/items/show/6380,"Charabanc - HLS01072","Charabanc, Group, People, People at Leisure, Road, Transport",Postcard.,,,,"No date yet","PH73 - Hebden Bridge Local History Society","PHDA - Hebden Bridge Local History Society","Pennine Horizons Digital Archive","TIFF file 8-bit","English (U.K.)","Documentary photograph",HLS01072.tif,,,,,,,,,,,,,,,,,,,,,,,,,,,,,,,,,,,,"Charabanc,Group,People,People at Leisure,Road,Transport",https://penninehorizons.org/files/original/ac6e35761eef941619688759e22799b8.jpg,"Still Image","Hebden Bridge Local History Society",1,0
6405,https://penninehorizons.org/items/show/6405,"Looking Towards the Site of White Horse Inn, 1974 - HLS01100","Cars, Hebden Bridge, Keighley Road, Places, Public Houses, Pubs Inns & Hotels, Road, St Georges Square, Street Names, Taverns, Transport, White Horse Hotel, White Lion Hotel",,"C Spencer",,,1970s,"PH29/2/14 - Hebden Bridge Local History Society","PHDA - Hebden Bridge Local History Society","Pennine Horizons Digital Archive","TIFF file 8-bit","English (U.K.)","Documentary photograph",HLS01100.tif,,,,,,,,,,,,,,,,,,,,,,,,,,,,,,,,,,,,"Cars,Hebden Bridge,Keighley Road,Public Houses,Pubs Inns and Hotels,Road,St Georges Square,Street Names,Taverns,Transport,White Horse Hotel,White Lion Hotel",https://penninehorizons.org/files/original/65e279174569c049476fa4d3f7507420.jpg,"Still Image","Hebden Bridge Local History Society",1,0
6644,https://penninehorizons.org/items/show/6644,"Quarry Road, Eaves - HLS01356","Eaves, Landscape, Quarry, Road",PH/12.,H.B.Smith,,,"No date yet",,"PHDA - Hebden Bridge Local History Society","Pennine Horizons Digital Archive","TIFF file 8-bit","English (U.K.)","Documentary photograph",HLS01356.tif,,,,,,,,,,,,,,,,,,,,,,,,,,,,,,,,,,,,"Eaves,Landscape,Quarry,Road",https://penninehorizons.org/files/original/f5e69ddc648779adc0d8637afd2fc77f.jpg,"Still Image","Hebden Bridge Local History Society",1,0
6812,https://penninehorizons.org/items/show/6812,"Hebden Bridge  - Hope Street - HLS05058","Albert Street, Animals, Banks, Baptist Chapel, Buildings, Cart, Church, Churches & Chapels, Churches_&_Chapels, Cobbles, Donkey Cart, Hebden Bridge, Hope Baptist Chapel, Hope Street, Horse drawn, Lantern Slide, Minster, Paths & Tracks, Pavement, People, People at Work, Places, Road, Stone Setts, Street Names, Transport, donkeys, horse drawn","Donkey cart on Albert Street crossing Hope Street; Hope Chapel to the right. Bank doorway behind (The plate is labelled ""possibly with Dan Wilcock in 1920s"" but the absence of tram cables visible on New Road would date it pre1901/2) Another caption says: Mr Copperall, an old resident of Hebden Bridge, with his donkey & cart in Albert Street. Ref: 053 Lit & Sci",,,,"No date yet",,"PHDA - Hebden Bridge Local History Society","Pennine Horizons Digital Archive","TIFF file 8-bit","English (U.K.)","Documentary photograph",HLS05058.tif,,,,,,,,,,,,,,,,,,,,,,,,,,,,,,,,,,,,"Albert Street,Animals,Banks,Baptist Chapel,Buildings,Cart,Church,Churches and Chapels,Cobbles,Donkey Cart,donkeys,Hebden Bridge,Hope Baptist Chapel,Hope Street,Horse,horse drawn,Lantern Slide,Minster,Paths & Tracks,Pavement,People,People at Work,Road,Stone Setts,Street Names,Transport",https://penninehorizons.org/files/original/de7a96db42557cc4397af7cc22736f9f.jpg,"Still Image","Hebden Bridge Local History Society",1,0
6823,https://penninehorizons.org/items/show/6823,"Hebden Bridge - St Georges Bridge about 1895 - HLS05070","Animals, Blackwater Street, Buildings, Co-op Building, Co-operative Movement, Cobbles, Delivery Van, Gas Lamp, Hebden Bridge, Hebden Water, Horse-drawn, Horses and Ponies, Lantern Slide, People, People at Work, Places, Retail, River, Road, Shop, Shops, St Georges Bridge, St Georges Square, Street Names, Transport, clock tower","Looking across St Georges Bridge, built 1893, to the Square and the large Co-op building with its clock tower. The building on the right on Blackwater Street was demolished to make way for the Council Offices which were built in 1897.",,,,1890s,"062 Lit & Sci","PHDA - Hebden Bridge Local History Society","Pennine Horizons Digital Archive","TIFF file 8-bit","English (U.K.)","Documentary photograph",HLS05070.tif,,,,,,,,,,,,,,,,,,,,,,,,,,,,,,,,,,,,"Animals,Blackwater Street,Buildings,Clock tower,Co-op Building,Co-operative Movement,Cobbles,Delivery Van,Gas Lamp,Hebden Bridge,Hebden Water,Horse,Horse-drawn,Horses and Ponies,Lantern Slide,People,People at Work,Retail,River,Road,Shop,Shops,St Georges Bridge,St Georges Square,Street Names,Transport",https://penninehorizons.org/files/original/f17e7c50cf7097d5413ae02a9a5ff2af.jpg,"Still Image","Hebden Bridge Local History Society",1,0
