﻿"Item Id","Item URI","Dublin Core:Title","Dublin Core:Subject","Dublin Core:Description","Dublin Core:Creator","Dublin Core:Source","Dublin Core:Publisher","Dublin Core:Date","Dublin Core:Contributor","Dublin Core:Rights","Dublin Core:Relation","Dublin Core:Format","Dublin Core:Language","Dublin Core:Type","Dublin Core:Identifier","Dublin Core:Coverage","Item Type Metadata:Lesson Plan Text","Item Type Metadata:Bibliography","Item Type Metadata:Biographical Text","Item Type Metadata:Occupation","Item Type Metadata:Death Date","Item Type Metadata:Birthplace","Item Type Metadata:Birth Date","Item Type Metadata:Participants","Item Type Metadata:Event Type","Item Type Metadata:URL","Item Type Metadata:Bit Rate/Frequency","Item Type Metadata:Interviewer","Item Type Metadata:Interviewee","Item Type Metadata:Location","Item Type Metadata:Transcription","Item Type Metadata:Local URL","Item Type Metadata:Original Format","Item Type Metadata:Physical Dimensions","Item Type Metadata:Duration","Item Type Metadata:Compression","Item Type Metadata:Producer","Item Type Metadata:Director","Item Type Metadata:Text","Item Type Metadata:Time Summary","Item Type Metadata:Email Body","Item Type Metadata:Subject Line","Item Type Metadata:From","Item Type Metadata:To","Item Type Metadata:CC","Item Type Metadata:BCC","Item Type Metadata:Number of Attachments","Item Type Metadata:Standards","Item Type Metadata:Objectives","Item Type Metadata:Materials",tags,file,itemType,collection,public,featured
10482,https://penninehorizons.org/items/show/10482,"Water Power - MOT00155","Buildings, Derelict mill, Mill, Mills, Places, Walsden, Water power","Waterstalls Mill, Walsden. One of the earliest examples of a Fielden owned cotton mill, the ruins of which still bear evidence to the harnessing of water power for the spinning industry, comprising three dams feeding a large water wheel which, in turn, provided the whole power for the mill.",,"Todmorden Information Centre Trust","Pennine Horizons Digital Archive","No date yet","Roger Birch","PHDA - Todmorden Information Centre Trust","Pennine Horizons Digital Archive","TIFF file 8-bit","English (U.K.)","Documentary photograph",MOT00155.tif,Todmorden,,,,,,,,,,,,,,,,,,,,,,,,,,,,,,,,,,,"Buildings,Derelict mill,Mill,Mills,Walsden,Water power",https://penninehorizons.org/files/original/6496bc38854c9e8880b8e54def523002.jpg,"Still Image","The Making of Todmorden exhibition",1,0
10483,https://penninehorizons.org/items/show/10483,"Water Power - MOT00156","Derelict mill, Places, Walsden, Water power","Waterstalls Mill, Walsden.  One of the earliest examples of a Fielden owned cotton mill, the ruins of which still bear evidence to the harnessing of water power for the spinning industry, comprising three dams feeding a large water wheel which, in turn, provided the whole power for the mill.",,"Todmorden Information Centre Trust","Pennine Horizons Digital Archive","No date yet","Roger Birch","PHDA - Todmorden Information Centre Trust","Pennine Horizons Digital Archive","TIFF file 8-bit","English (U.K.)","Documentary photograph",MOT00156.tif,Todmorden,,,,,,,,,,,,,,,,,,,,,,,,,,,,,,,,,,,"Derelict mill,Walsden,Water power",https://penninehorizons.org/files/original/2002b331dd3527a5500990959689ca15.jpg,"Still Image","The Making of Todmorden exhibition",1,0
10487,https://penninehorizons.org/items/show/10487,"View over Walsden - MOT00160","Buildings, Chimney, Chimneys, Church, Churches & Chapels, Churches_&_Chapels, Goods Wagons, Mill, Mills, Minster, Places, Railway, Railways, Walsden, Water power","Walsden, viewed from Gauxholme Stones, in the 1950s.  the station just visible on the right. Clough Mill, in the foreground, is thought to be the first cotton mill in the Todmorden area.  Through the years it has been occupied by a variety of trades including picker making, pattern making and joinery, and was demolished to provide a residential site.  The chimneys in the background, left to right, are those of Hollins Bottom Mill, the Clog Iron Shop and Hollins Mill.  In the upper right - without a chimney - is Birks Mill.",,"Todmorden Information Centre Trust","Pennine Horizons Digital Archive",1950s,"Roger Birch","PHDA - Todmorden Information Centre Trust","Pennine Horizons Digital Archive","TIFF file 8-bit","English (U.K.)","Documentary photograph",MOT00160.tif,Todmorden,,,,,,,,,,,,,,,,,,,,,,,,,,,,,,,,,,,"Buildings,Chimney,Chimneys,Church,Churches and Chapels,Goods Wagons,Mill,Mills,Minster,Railway,Railways,Walsden,Water power",https://penninehorizons.org/files/original/4b26fa022117dbccee8dd6ad6761677b.jpg,"Still Image","The Making of Todmorden exhibition",1,0
10494,https://penninehorizons.org/items/show/10494," Ramsden Wood Mill, Walsden about 1870 - MOT00167","Buildings, Chimney, Chimneys, Mill, Mills, Places, Steam Power, Walsden","Originally built as a cotton spinning mill in the early 19th Century, the buildings were later converted to a print and dye works.  The abundant water supply was the chief reason for the selection of the site, but the chimney which is situated on the millside provides evidence that steam power was also used.",,"Todmorden Information Centre Trust","Pennine Horizons Digital Archive",1870s,"Roger Birch","PHDA - Todmorden Information Centre Trust","Pennine Horizons Digital Archive","TIFF file 8-bit","English (U.K.)","Documentary photograph",MOT00167.tif,Todmorden,,,,,,,,,,,,,,,,,,,,,,,,,,,,,,,,,,,"Buildings,Chimney,Chimneys,Mill,Mills,Steam Power,Walsden",https://penninehorizons.org/files/original/0fc14c5c0310159629bbf3f49bfc1377.jpg,"Still Image","The Making of Todmorden exhibition",1,0
10495,https://penninehorizons.org/items/show/10495,"Ramsden Wood Mill, Walsden about 1870  - MOT00168","Buildings, Chimney, Chimneys, Mill, Mills, Places, Steam Power, Walsden, Water Tower","Originally built as a cotton spinning mill in the early 19th Century, the buildings were later converted to a print and dye works.  The abundant water supply was the chief reason for the selection of the site, but the chimney which is situated on the millside provides evidence that steam power was also used.",,"Todmorden Information Centre Trust","Pennine Horizons Digital Archive",1870s,"Roger Birch","PHDA - Todmorden Information Centre Trust","Pennine Horizons Digital Archive","TIFF file 8-bit","English (U.K.)","Documentary photograph",MOT00168.tif,Todmorden,,,,,,,,,,,,,,,,,,,,,,,,,,,,,,,,,,,"Buildings,Chimney,Chimneys,Mill,Mills,Steam Power,Walsden,Water Tower",https://penninehorizons.org/files/original/a4e64b8a43254bc79ce846bd56153f5e.jpg,"Still Image","The Making of Todmorden exhibition",1,0
10497,https://penninehorizons.org/items/show/10497,"Ramsden Wood Mill - MOT00170","Buildings, Interior, Mill, Mills, People, People at Work, Places, Steam Power, Walsden","Wood block printers at Ramsden Wood works. The man standing on the left of the table is Matthew Barr, of Walsden.",,"Todmorden Information Centre Trust","Pennine Horizons Digital Archive","No date yet","Roger Birch","PHDA - Todmorden Information Centre Trust","Pennine Horizons Digital Archive","TIFF file 8-bit","English (U.K.)","Documentary photograph",MOT00170.tif,Todmorden,,,,,,,,,,,,,,,,,,,,,,,,,,,,,,,,,,,"Buildings,Interior,Mill,Mills,People,People at Work,Steam Power,Walsden",https://penninehorizons.org/files/original/ff404769f5617c9526eae7a32a99d0c3.jpg,"Still Image","The Making of Todmorden exhibition",1,0
10914,https://penninehorizons.org/items/show/10914," - MOT00137","Buildings, Chimney, Chimneys, Mill, Mills, Places, Snow, Walsden, winter","Looking over Walsden sports field to Scar Rocks, c 1910. The small building on the left, called, 'Jerico' once stood on the line of the old canal. Winterbutlee Mill now gordon Rigg's Garden Centre, can be seen on the right. The mill in the middle distance is Ormerod Taylor's Chemical works - Sunvale Works - Deanroyd Mill can be seen in the far distance. 

Board 06A of the Made in Todmorden Exhibition.",,"Todmorden Information Centre Trust","Pennine Horizons Digital Archive",1910s,"Roger Birch","PHDA - Todmorden Information Centre Trust","Pennine Horizons Digital Archive","TIFF file 8-bit","English (U.K.)","Documentary photograph",MOT00137.tif,Todmorden,,,,,,,,,,,,,,,,,,,,,,,,,,,,,,,,,,,"1910s,Buildings,Chimney,Chimneys,Mill,Mills,Snow,Walsden,winter",https://penninehorizons.org/files/original/b5e4d6a77e3813e102b3e3b42e037777.jpg,"Still Image","The Making of Todmorden exhibition",1,0
12937,https://penninehorizons.org/items/show/12937,"Walsden Signal Box - LYR00286","Lancashire & Yorkshire Railway, Manchester & Leeds Railway, Railway, Railways, Signal box, Summit Tunnel, Tunnel, Walsden","LYRS 3788 - Summit Tunnel East Signal Box (pre-1895) at Walsden.",Unknown,"Lancashire & Yorkshire Railway Society","Pennine Horizons Digital Archive","No date yet","Lancashire & Yorkshire Railway Society","PHDA - Lancashire & Yorkshire Railway Society","Pennine Horizons Digital Archive","TIFF file 8-bit","English (U.K.)","Documentary photograph",LYR00286.tif,,,,,,,,,,,,,,,,,,,,,,,,,,,,,,,,,,,,"Lancashire and Yorkshire Railway,Manchester and Leeds Railway,Railway,Railways,Signal box,Summit Tunnel,Tunnel,Walsden",https://penninehorizons.org/files/original/e4d990924daf3889297813ca2b29b591.jpg,"Still Image","The Lancashire & Yorkshire Railway Society",1,0
12938,https://penninehorizons.org/items/show/12938,"Walsden Signal Box - LYR00287","Lancashire & Yorkshire Railway, Manchester & Leeds Railway, Railway, Railways, Signal box, Summit Tunnel, Tunnel, Walsden","LYRS 3861 - Summit Tunnel East Signal Box (post-1895) - Walsden",Unknown,"Lancashire & Yorkshire Railway Society","Pennine Horizons Digital Archive","No date yet","Lancashire & Yorkshire Railway Society","PHDA - Lancashire & Yorkshire Railway Society","Pennine Horizons Digital Archive","TIFF file 8-bit","English (U.K.)","Documentary photograph",LYR00287.tif,,,,,,,,,,,,,,,,,,,,,,,,,,,,,,,,,,,,"Lancashire and Yorkshire Railway,Manchester and Leeds Railway,Railway,Railways,Signal box,Summit Tunnel,Tunnel,Walsden",https://penninehorizons.org/files/original/9219c1de007d7933c0893a48f96546dc.jpg,"Still Image","The Lancashire & Yorkshire Railway Society",1,0
12939,https://penninehorizons.org/items/show/12939,"Walsden Signal Box - LYR00288","Lancashire & Yorkshire Railway, Manchester & Leeds Railway, People, People at Work, Railway, Railway Signalman, Railways, Signal box, Summit Tunnel, Tunnel, Walsden","LYRS 3862 - Summit Tunnel East Box Interior.",Unknown,"Lancashire & Yorkshire Railway Society","Pennine Horizons Digital Archive","No date yet","Lancashire & Yorkshire Railway Society","PHDA - Lancashire & Yorkshire Railway Society","Pennine Horizons Digital Archive","TIFF file 8-bit","English (U.K.)","Documentary photograph",LYR00288.tif,,,,,,,,,,,,,,,,,,,,,,,,,,,,,,,,,,,,"Lancashire and Yorkshire Railway,Manchester and Leeds Railway,People,People at Work,Railway,Railway Signalman,Railways,Signal box,Summit Tunnel,Tunnel,Walsden",https://penninehorizons.org/files/original/aebf2568f3f7b89bda7282f7a85dea7c.jpg,"Still Image","The Lancashire & Yorkshire Railway Society",1,0
22430,https://penninehorizons.org/items/show/22430,"Wesley Chapel, Walsden, 1972 - TNC00134","Buildings, Church, Churches & Chapels, Churches_&_Chapels, Demolition, Derelict, Minster, Todmorden, Walsden",,"Thomas Newell","Thomas Newell","Pennine Horizons Digital Archive","1972, 1970s",,"PHDA - Thomas Newell Collection","Pennine Horizons Digital Archive","TIFF file 8-bit","English (U.K.)","Documentary photograph",TNC00134.tif,,,,,,,,,,,,,,,,,,,,,,,,,,,,,,,,,,,,"Buildings,Church,Churches & Chapels,Churches_&_Chapels,Demolition,Derelict,Minster,Todmorden,Walsden",https://penninehorizons.org/files/original/df6f972d66b13849a80893b21592d142.jpg,"Still Image","Thomas Newell collection",1,0
22431,https://penninehorizons.org/items/show/22431,"Wesley Chapel, Walsden, 1972 - TNC00135","Buildings, Church, Churches & Chapels, Churches_&_Chapels, Demolition, Derelict, Minster, Todmorden, Walsden",,"Thomas Newell","Thomas Newell","Pennine Horizons Digital Archive","1972, 1970s",,"PHDA - Thomas Newell Collection","Pennine Horizons Digital Archive","TIFF file 8-bit","English (U.K.)","Documentary photograph",TNC00135.tif,,,,,,,,,,,,,,,,,,,,,,,,,,,,,,,,,,,,"Buildings,Church,Churches & Chapels,Churches_&_Chapels,Demolition,Derelict,Minster,Todmorden,Walsden",https://penninehorizons.org/files/original/235b66753b9067f50ac97649f2340f12.jpg,"Still Image","Thomas Newell collection",1,0
22607,https://penninehorizons.org/items/show/22607,"Walsden 1981  - TNC00312.tif","Landscape, Walsden, walkers","Walking Group overlooking Walsden","Thomas Newell","Thomas Newell","Pennine Horizons Digital Archive","1981, 1980s",,"PHDA - Thomas Newell Collection","Pennine Horizons Digital Archive","TIFF file 8-bit","English (U.K.)","Documentary photograph",TNC00312.tif,,,,,,,,,,,,,,,,,,,,,,,,,,,,,,,,,,,,"Landscape,walkers,Walsden",https://penninehorizons.org/files/original/a09ea6a8ae04714f9f27c444fbee51a7.jpg,"Still Image","Thomas Newell collection",1,0
22608,https://penninehorizons.org/items/show/22608,"Walsden near Todmorden, 1981  - TNC00313.tif","Cricket Ground, Railway line, Recreation ground, Sport and Recreation, Walsden","Railway line and bridge. This section of the Manchester & Leeds Railway between Hebden Bridge and Summit East was completed in December 1840.","Thomas Newell","Thomas Newell","Pennine Horizons Digital Archive","1981, 1980s",,"PHDA - Thomas Newell Collection","Pennine Horizons Digital Archive","TIFF file 8-bit","English (U.K.)","Documentary photograph",TNC00313.tif,,,,,,,,,,,,,,,,,,,,,,,,,,,,,,,,,,,,"Cricket Ground,Railway line,Recreation ground,Sport and recreation,Walsden",https://penninehorizons.org/files/original/a528a647fa87a97c295f73e63422eeab.jpg,"Still Image","Thomas Newell collection",1,0
22610,https://penninehorizons.org/items/show/22610,"Above Walsden 1981  - TNC00315.tif","Derelict, Moorland, Paths & Tracks, Walsden, walkers","Walking Group on moors near a derelict farm.","Thomas Newell","Thomas Newell","Pennine Horizons Digital Archive","1981, 1980s",,"PHDA - Thomas Newell Collection","Pennine Horizons Digital Archive","TIFF file 8-bit","English (U.K.)","Documentary photograph",TNC00315.tif,,,,,,,,,,,,,,,,,,,,,,,,,,,,,,,,,,,,"Derelict,Moorland,Paths & Tracks,walkers,Walsden",https://penninehorizons.org/files/original/8bb34c15d25455db6c2a1e5131c557fe.jpg,"Still Image","Thomas Newell collection",1,0
22611,https://penninehorizons.org/items/show/22611,"Walsden 1981  - TNC00316.tif","Buildings, Dobroyd Castle, Fields, Houses, M&LR, Railway, Railway line, Railways, Trees, Walsden, hillside","View towards Todmorden with the tower of Dobroyd Castle above the distant trees left of centre. The railway was built 1840 by the Manchester & Leeds Railway.","Thomas Newell","Thomas Newell","Pennine Horizons Digital Archive","1981, 1980s",,"PHDA - Thomas Newell Collection","Pennine Horizons Digital Archive","TIFF file 8-bit","English (U.K.)","Documentary photograph",TNC00316.tif,,,,,,,,,,,,,,,,,,,,,,,,,,,,,,,,,,,,"Buildings,Dobroyd Castle,Fields,hillside,Houses,M&LR,Railway,Railway line,Railways,Trees,Walsden",https://penninehorizons.org/files/original/23151d16b2d26e899596574b5065c360.jpg,"Still Image","Thomas Newell collection",1,0
22621,https://penninehorizons.org/items/show/22621,"Walsden, Todmorden, 1981  - TNC00326.tif","Buildings, Dobroyd Castle, Fields, Gauxholme, Houses, Moorland, Railway line, Todmorden, Trees, Viaduct, Walsden, hillside","View over Gauxholme with the railway on the left curving to cross the Gauxholme Viaduct with the tower of Dobroyd Castle visible above it.","Thomas Newell","Thomas Newell","Pennine Horizons Digital Archive","1981, 1980s",,"PHDA - Thomas Newell Collection","Pennine Horizons Digital Archive","TIFF file 8-bit","English (U.K.)","Documentary photograph",TNC00326.tif,,,,,,,,,,,,,,,,,,,,,,,,,,,,,,,,,,,,"Buildings,Dobroyd Castle,Fields,Gauxholme,hillside,Houses,Moorland,Railway line,Todmorden,Trees,Viaduct,Walsden",https://penninehorizons.org/files/original/3c5b8686b572cf96c19796eb7e99b383.jpg,"Still Image","Thomas Newell collection",1,0
22624,https://penninehorizons.org/items/show/22624,"Walkers at Walsden, 1991  - TNC00329.tif","Agricultural building, Paths & Tracks, Walsden, walkers",,"Thomas Newell","Thomas Newell","Pennine Horizons Digital Archive","1991, 1990s",,"PHDA - Thomas Newell Collection","Pennine Horizons Digital Archive","TIFF file 8-bit","English (U.K.)","Documentary photograph",TNC00329.tif,,,,,,,,,,,,,,,,,,,,,,,,,,,,,,,,,,,,"Agricultural building,Paths & Tracks,walkers,Walsden",https://penninehorizons.org/files/original/c5c61bd315f03febb42f91af85af225e.jpg,"Still Image","Thomas Newell collection",1,0
22625,https://penninehorizons.org/items/show/22625,"Walkers at Walsden, 1991  - TNC00330.tif","Agricultural building, Paths & Tracks, Walsden, walkers",,"Thomas Newell","Thomas Newell","Pennine Horizons Digital Archive","1991, 1990s",,"PHDA - Thomas Newell Collection","Pennine Horizons Digital Archive","TIFF file 8-bit","English (U.K.)","Documentary photograph",TNC00330.tif,,,,,,,,,,,,,,,,,,,,,,,,,,,,,,,,,,,,"Agricultural building,Paths & Tracks,walkers,Walsden",https://penninehorizons.org/files/original/df2210565b7f34b2196c31f2301a5791.jpg,"Still Image","Thomas Newell collection",1,0
22626,https://penninehorizons.org/items/show/22626,"Walsden 1981  - TNC00331.tif","Buildings, Copprashouse, Fields, Gauxholme, Houses, Moorland, Railway line, School, Schools, Shade, Todmorden, Trees, Walsden, hillside","View over Gauxholme/Copprashouse with  the tower of Dobroyd Castle visible above it. Bottom right Shade School.","Thomas Newell","Thomas Newell","Pennine Horizons Digital Archive","1981, 1980s",,"PHDA - Thomas Newell Collection","Pennine Horizons Digital Archive","TIFF file 8-bit","English (U.K.)","Documentary photograph",TNC00331.tif,,,,,,,,,,,,,,,,,,,,,,,,,,,,,,,,,,,,"Buildings,Copprashouse,Fields,Gauxholme,hillside,Houses,Moorland,Railway line,School,Schools,Shade,Todmorden,Trees,Walsden",https://penninehorizons.org/files/original/5227d2a6785054ca24e4d413fbf77852.jpg,"Still Image","Thomas Newell collection",1,0
22627,https://penninehorizons.org/items/show/22627,"Walsden, 1981  - TNC00332.tif","Bowling Green, Cricket Ground, Garden Centre, Railway line, Rochdale Canal, Sport and Recreation, Todmorden, Walsden","A good view of the cricket field with the railway line and Rochdale Canal to the left of the picture. The complex of buildings to the eft of the road is Gordon Rigg's Garden Centre.","Thomas Newell","Thomas Newell","Pennine Horizons Digital Archive","1981, 1980s",,"PHDA - Thomas Newell Collection","Pennine Horizons Digital Archive","TIFF file 8-bit","English (U.K.)","Documentary photograph",TNC00332.tif,,,,,,,,,,,,,,,,,,,,,,,,,,,,,,,,,,,,"Bowling Green,Cricket Ground,Garden Centre,Railway line,Rochdale Canal,Sport and recreation,Todmorden,Walsden",https://penninehorizons.org/files/original/ab523c6d4712e66eda8d743b2a0e06a3.jpg,"Still Image","Thomas Newell collection",1,0
22785,https://penninehorizons.org/items/show/22785,"Copperas House, Todmorden 1985  - TNC00490.tif","Chimney, Chimneys, Mill, Places, Todmorden, Walsden","A view of Copperas House, Walsden taken from the rear of the property.","Thomas Newell","Thomas Newell","Pennine Horizons Digital Archive","1985, 1980s",,"PHDA - Thomas Newell Collection","Pennine Horizons Digital Archive","TIFF file 8-bit","English (U.K.)","Documentary photograph",TNC00490.tif,,,,,,,,,,,,,,,,,,,,,,,,,,,,,,,,,,,,"Chimney,Chimneys,Mill,Places,Todmorden,Walsden",https://penninehorizons.org/files/original/4e80952b50ca29861f860148ca6b9b54.jpg,"Still Image","Thomas Newell collection",1,0
23889,https://penninehorizons.org/items/show/23889,"Walsden From Below Law Hey Farm - CRN00136","Landscape, Todmorden, Walsden",,"Christine Newell","Christine Newell","Pennine Horizons Digital Archive","2001 , 2000s","Christine Newell","PHDA - Christine Newell Collection","Pennine Horizons Digital Archive","TIFF file 8-bit","English (U.K.)","Documentary photograph",CRN00136.tif,,,,,,,,,,,,,,,,,,,,,,,,,,,,,,,,,,,,"Landscape,Todmorden,Walsden",https://penninehorizons.org/files/original/3da8ccc188b09125f657bc25d0a3185e.jpg,"Still Image","Christine Newell collection",1,0
23891,https://penninehorizons.org/items/show/23891,"Canal Basin Behind Gordon Riggs - CRN00138","Rochdale Canal, Todmorden, Towpath, Walsden",,"Christine Newell","Christine Newell","Pennine Horizons Digital Archive","2001 , 2000s","Christine Newell","PHDA - Christine Newell Collection","Pennine Horizons Digital Archive","TIFF file 8-bit","English (U.K.)","Documentary photograph",CRN00138.tif,,,,,,,,,,,,,,,,,,,,,,,,,,,,,,,,,,,,"Rochdale Canal,Todmorden,Towpath,Walsden",https://penninehorizons.org/files/original/d87da969bc56098b2a26150b1b9a060b.jpg,"Still Image","Christine Newell collection",1,0
24260,https://penninehorizons.org/items/show/24260,"From Bottomley At Walsden - CRN00220","Bottomley, Burnley Road, Moorland, Street Names, Todmorden, Walsden","Looking towards Whirlaw with Flower Scar beyond. August 3rd, 2002","Christine Newell","Christine Newell","Pennine Horizons Digital Archive","2002 , 2000s","Christine Newell","PHDA - Christine Newell Collection","Pennine Horizons Digital Archive","TIFF file 8-bit","English (U.K.)","Documentary photograph",CRN00220.tif,,,,,,,,,,,,,,,,,,,,,,,,,,,,,,,,,,,,"Bottomley,Burnley Road,Moorland,Street Names,Todmorden,Walsden",https://penninehorizons.org/files/original/3f955e756786671957a2cca9543d4c6b.jpg,"Still Image","Christine Newell collection",1,0
