﻿"Item Id","Item URI","Dublin Core:Title","Dublin Core:Subject","Dublin Core:Description","Dublin Core:Creator","Dublin Core:Source","Dublin Core:Publisher","Dublin Core:Date","Dublin Core:Contributor","Dublin Core:Rights","Dublin Core:Relation","Dublin Core:Format","Dublin Core:Language","Dublin Core:Type","Dublin Core:Identifier","Dublin Core:Coverage","Item Type Metadata:Lesson Plan Text","Item Type Metadata:Bibliography","Item Type Metadata:Biographical Text","Item Type Metadata:Occupation","Item Type Metadata:Death Date","Item Type Metadata:Birthplace","Item Type Metadata:Birth Date","Item Type Metadata:Participants","Item Type Metadata:Event Type","Item Type Metadata:URL","Item Type Metadata:Bit Rate/Frequency","Item Type Metadata:Interviewer","Item Type Metadata:Interviewee","Item Type Metadata:Location","Item Type Metadata:Transcription","Item Type Metadata:Local URL","Item Type Metadata:Original Format","Item Type Metadata:Physical Dimensions","Item Type Metadata:Duration","Item Type Metadata:Compression","Item Type Metadata:Producer","Item Type Metadata:Director","Item Type Metadata:Text","Item Type Metadata:Time Summary","Item Type Metadata:Email Body","Item Type Metadata:Subject Line","Item Type Metadata:From","Item Type Metadata:To","Item Type Metadata:CC","Item Type Metadata:BCC","Item Type Metadata:Number of Attachments","Item Type Metadata:Standards","Item Type Metadata:Objectives","Item Type Metadata:Materials",tags,file,itemType,collection,public,featured
11099,https://penninehorizons.org/items/show/11099,"Working horse on the Marina, Hebden Bridge - BIM00282","Animals, Colour, Hebden Bridge, Horses and Ponies, Marina, Places",,"Bill Marsden","Bill Marsden","Pennine Horizons Digital Archive",1990s,,"PHDA - Bill Marsden Collection","Pennine Horizons Digital Archive","TIFF file 8-bit","English (U.K.)","Documentary photograph",BIM00282.tif,"Hebden Bridge",,,,,,,,,,,,,,,,,,,,,,,,,,,,,,,,,,,"#Horse,Animals,Colour,Hebden Bridge,Horse,Horses and Ponies,Marina",https://penninehorizons.org/files/original/f937ec47c6f27a1e952ee777e5b06ad8.jpg,"Still Image","Bill Marsden collection",1,0
11049,https://penninehorizons.org/items/show/11049,"Wind turbines at Cliviger - BIM00232","Animals, Cliviger, Places, Wind Farm",,"Bill Marsden","Bill Marsden","Pennine Horizons Digital Archive",1990s,,"PHDA - Bill Marsden Collection","Pennine Horizons Digital Archive","TIFF file 8-bit","English (U.K.)","Documentary photograph",BIM00232.tif,"Hebden Bridge",,,,,,,,,,,,,,,,,,,,,,,,,,,,,,,,,,,"Animals,Cliviger,Wind Farm",https://penninehorizons.org/files/original/971db059a6a8b96b6c25b0eadfaee9e1.jpg,"Still Image","Bill Marsden collection",1,0
11048,https://penninehorizons.org/items/show/11048,"Wind turbine at Cliviger - BIM00231","Animals, Cliviger, Colour, Cow, Pendle Hill, Places, Wind Farm","Pendle Hill in the background","Bill Marsden","Bill Marsden","Pennine Horizons Digital Archive",1990s,,"PHDA - Bill Marsden Collection","Pennine Horizons Digital Archive","TIFF file 8-bit","English (U.K.)","Documentary photograph",BIM00231.tif,"Hebden Bridge",,,,,,,,,,,,,,,,,,,,,,,,,,,,,,,,,,,"Animals,Cliviger,Colour,Cow,Pendle Hill,Wind Farm",https://penninehorizons.org/files/original/f1ea8de3cd11cdfd5f78392de1ac495a.jpg,"Still Image","Bill Marsden collection",1,0
11047,https://penninehorizons.org/items/show/11047,"Wind turbine - BIM00230","Cliviger, Places, Wind Farm",,"Bill Marsden","Bill Marsden","Pennine Horizons Digital Archive",1990s,,"PHDA - Bill Marsden Collection","Pennine Horizons Digital Archive","TIFF file 8-bit","English (U.K.)","Documentary photograph",BIM00230.tif,"Hebden Bridge",,,,,,,,,,,,,,,,,,,,,,,,,,,,,,,,,,,"Cliviger,Wind Farm",https://penninehorizons.org/files/original/6cc049a0ef5106f9cdd348882713404e.jpg,"Still Image","Bill Marsden collection",1,0
11046,https://penninehorizons.org/items/show/11046,"Wind turbine - BIM00229","Cliviger, Places, Wind Farm",,"Bill Marsden","Bill Marsden","Pennine Horizons Digital Archive",1990s,,"PHDA - Bill Marsden Collection","Pennine Horizons Digital Archive","TIFF file 8-bit","English (U.K.)","Documentary photograph",BIM00229.tif,"Hebden Bridge",,,,,,,,,,,,,,,,,,,,,,,,,,,,,,,,,,,"Cliviger,Wind Farm",https://penninehorizons.org/files/original/e31af9981d8fb96d8b8fbdface9de631.jpg,"Still Image","Bill Marsden collection",1,0
11045,https://penninehorizons.org/items/show/11045,"Wind turbine - BIM00228","Cliviger, Places, Wind Farm",,"Bill Marsden","Bill Marsden","Pennine Horizons Digital Archive",1990s,,"PHDA - Bill Marsden Collection","Pennine Horizons Digital Archive","TIFF file 8-bit","English (U.K.)","Documentary photograph",BIM00228.tif,"Hebden Bridge",,,,,,,,,,,,,,,,,,,,,,,,,,,,,,,,,,,"Cliviger,Wind Farm",https://penninehorizons.org/files/original/f70e0996755f3f062669ea69837b167c.jpg,"Still Image","Bill Marsden collection",1,0
11041,https://penninehorizons.org/items/show/11041,"Wind Farm at Cliviger - BIM00224","Cliviger, Colour, Landscape, Paths & Tracks, Places, Wind Farm",,"Bill Marsden","Bill Marsden","Pennine Horizons Digital Archive",1990s,,"PHDA - Bill Marsden Collection","Pennine Horizons Digital Archive","TIFF file 8-bit","English (U.K.)","Documentary photograph",BIM00224.tif,"Hebden Bridge",,,,,,,,,,,,,,,,,,,,,,,,,,,,,,,,,,,"Cliviger,Colour,Landscape,Paths & Tracks,Wind Farm",https://penninehorizons.org/files/original/911b49c3245deabad8dca3e6aacecfb6.jpg,"Still Image","Bill Marsden collection",1,0
11059,https://penninehorizons.org/items/show/11059,"Widdop Reservoir - BIM00242","Animals, Colour, Landscape, Moorland, Places, Widdop","The provision of public water supplies for the Halifax district was of great concern in the second half of the 19th century.  As the town grew and the population increased the Victoria Reservoir created in 1848 in Gibbet Lane proved inadequate to the demand.  The Corporation were forced to look further afield for their supplies, to the peat moors to the north and west of Halifax.  Reservoirs at Ogden, Walshaw Dean, Fly Flatts and Widdop date from this period.  Widdop was constructed between 1872 and 1878 by the architect and engineer Edward Bateman, honoured with the name of ‘La Trobe’ after the Moravian engineer, Benjamin Henry Latrobe, who was responsible for some of the first piped water supplies in America.  Bateman was the only British engineer to be invited to attend the opening of the Suez Canal in 1869 where he was much taken with Egyptian architecture - as can be seen from the valve tower he built at the south-east corner of Widdop reservoir.

Text from: Calderdale Architecture and History","Bill Marsden","Bill Marsden","Pennine Horizons Digital Archive",1990s,,"PHDA - Bill Marsden Collection","Pennine Horizons Digital Archive","TIFF file 8-bit","English (U.K.)","Documentary photograph",BIM00242.tif,"Hebden Bridge",,,,,,,,,,,,,,,,,,,,,,,,,,,,,,,,,,,"Animals,Colour,Landscape,Moorland,Widdop",https://penninehorizons.org/files/original/d8f5e991ec320dfec8319a7cf8809643.jpg,"Still Image","Bill Marsden collection",1,0
11202,https://penninehorizons.org/items/show/11202,"White Lion Hotel, Hebden Bridge. - BIM00385","Drip Stones, Hebden Bridge, Places, Public Houses, Pubs Inns & Hotels, Taverns, White Lion Hotel",,"Bill Marsden","Bill Marsden","Pennine Horizons Digital Archive",1990s,,"PHDA - Bill Marsden Collection","Pennine Horizons Digital Archive","TIFF file 8-bit","English (U.K.)","Documentary photograph",BIM00385.tif,"Hebden Bridge",,,,,,,,,,,,,,,,,,,,,,,,,,,,,,,,,,,"Drip Stones,Hebden Bridge,Public Houses,Pubs Inns and Hotels,Taverns,White Lion Hotel",https://penninehorizons.org/files/original/0ff13dfe2b28ffaf94e85c7d30c520a2.jpg,"Still Image","Bill Marsden collection",1,0
10945,https://penninehorizons.org/items/show/10945,"West End, Hebden Bridge. - BIM00128","Hebden Bridge, Places, West End","Formally 018BM. New Road, Hebden Bridge, c1989","Bill Marsden","Bill Marsden","Pennine Horizons Digital Archive",1990s,,"PHDA - Bill Marsden Collection","Pennine Horizons Digital Archive","TIFF file 8-bit","English (U.K.)","Documentary photograph",BIM00128.tif,"Hebden Bridge",,,,,,,,,,,,,,,,,,,,,,,,,,,,,,,,,,,"Hebden Bridge,West End",https://penninehorizons.org/files/original/ec3bab32382e8a6b7e5a985e1774a0c4.jpg,"Still Image","Bill Marsden collection",1,0
11205,https://penninehorizons.org/items/show/11205,"West End, Hebden Bridge shops - BIM00389","Buildings, Hebden Bridge, Places, Retail, Shop, Shops, West End",,"Bill Marsden","Bill Marsden","Pennine Horizons Digital Archive",1990s,,"PHDA - Bill Marsden Collection","Pennine Horizons Digital Archive","TIFF file 8-bit","English (U.K.)","Documentary photograph",BIM00389.tif,"Hebden Bridge",,,,,,,,,,,,,,,,,,,,,,,,,,,,,,,,,,,"Buildings,Hebden Bridge,Retail,Shop,Shops,West End",https://penninehorizons.org/files/original/e63dc47723a1fd489c174f52c94a6e08.jpg,"Still Image","Bill Marsden collection",1,0
10920,https://penninehorizons.org/items/show/10920,"West End, Hebden Bridge - BIM00102","Hebden Bridge, New Road, Places, Street Names, Tourist Information, Transport",,"Bill Marsden","Bill Marsden","Pennine Horizons Digital Archive",1990s,,"PHDA - Bill Marsden Collection","Pennine Horizons Digital Archive","TIFF file 8-bit","English (U.K.)","Documentary photograph",BIM00102.tif,"Hebden Bridge",,,,,,,,,,,,,,,,,,,,,,,,,,,,,,,,,,,"Hebden Bridge,New Road,Street Names,Tourist Information,Transport",https://penninehorizons.org/files/original/b63aaf2770c84cff4af25491ae18e540.jpg,"Still Image","Bill Marsden collection",1,0
10928,https://penninehorizons.org/items/show/10928,"Weaver's Square, Heptonstall - BIM00110","Church, Churches & Chapels, Churches_&_Chapels, Heptonstall, Minster, Places, St Thomas a Becket, Weavers Square",,"Bill Marsden","Bill Marsden","Pennine Horizons Digital Archive",1990s,At841abm,"PHDA - Bill Marsden Collection","Pennine Horizons Digital Archive","TIFF file 8-bit","English (U.K.)","Documentary photograph",BIM00110.tif,"Hebden Bridge",,,,,,,,,,,,,,,,,,,,,,,,,,,,,,,,,,,"Church,Churches and Chapels,Heptonstall,Minster,St Thomas a Becket,Weavers Square",https://penninehorizons.org/files/original/1fa82af8963430a97ccaf213c556c4ca.jpg,"Still Image","Bill Marsden collection",1,0
33235,https://penninehorizons.org/items/show/33235,"Waterloo Bank, Old Town - HCC00713","Houses, Old Town","Waterloo Bank, built in 1894 by the Mitchell family. These houses (and many others in the area) were at one time owned by Abraham Gibson (1887 - 1956) and Constance Calverley (1882 - 1948), who were the last survivors of the Mitchell and Gibson dynasties. Both died unmarried and childless. The photograph was taken some time between 1991 and 1997.",Unknown,,"Pennine Horizons Digital Archive",1990s,,"PHDA - Horizons Community Collection","Pennine Horizons Digital Archive","TIFF file 8-bit","English (U.K.)","Documentary photograph",HCC00713.tif,,,,,,,,,,,,,,,,,,,,,,,,,,,,,,,,,,,,,https://penninehorizons.org/files/original/a1b9846a4eb9c4e2c180983739169d93.jpg,"Still Image","Community collection",1,0
10951,https://penninehorizons.org/items/show/10951,"Warley - BIM00134","Animals, Postcard, pastoral","Postcard. 1960s.","Bill Marsden","Bill Marsden","Pennine Horizons Digital Archive",1990s,,"PHDA - Bill Marsden Collection","Pennine Horizons Digital Archive","TIFF file 8-bit","English (U.K.)","Documentary photograph",BIM00134.tif,"Hebden Bridge",,,,,,,,,,,,,,,,,,,,,,,,,,,,,,,,,,,"Animals,pastoral,Postcard",https://penninehorizons.org/files/original/9dae5eb3f86f94110f236c9d7da2ffa6.jpg,"Still Image","Bill Marsden collection",1,0
22625,https://penninehorizons.org/items/show/22625,"Walkers at Walsden, 1991  - TNC00330.tif","Agricultural building, Paths & Tracks, Walsden, walkers",,"Thomas Newell","Thomas Newell","Pennine Horizons Digital Archive","1991, 1990s",,"PHDA - Thomas Newell Collection","Pennine Horizons Digital Archive","TIFF file 8-bit","English (U.K.)","Documentary photograph",TNC00330.tif,,,,,,,,,,,,,,,,,,,,,,,,,,,,,,,,,,,,"Agricultural building,Paths & Tracks,walkers,Walsden",https://penninehorizons.org/files/original/df2210565b7f34b2196c31f2301a5791.jpg,"Still Image","Thomas Newell collection",1,0
22624,https://penninehorizons.org/items/show/22624,"Walkers at Walsden, 1991  - TNC00329.tif","Agricultural building, Paths & Tracks, Walsden, walkers",,"Thomas Newell","Thomas Newell","Pennine Horizons Digital Archive","1991, 1990s",,"PHDA - Thomas Newell Collection","Pennine Horizons Digital Archive","TIFF file 8-bit","English (U.K.)","Documentary photograph",TNC00329.tif,,,,,,,,,,,,,,,,,,,,,,,,,,,,,,,,,,,,"Agricultural building,Paths & Tracks,walkers,Walsden",https://penninehorizons.org/files/original/c5c61bd315f03febb42f91af85af225e.jpg,"Still Image","Thomas Newell collection",1,0
3365,https://penninehorizons.org/items/show/3365,"W.J.A.C. Fifty Years Reunion 1942 to 1992 - DAH00143","Celebration, Event, Events, Group, People","Women's Junior Air Corp. Seated on the floor, Unknown, Mary Sayer nee Sunderland, Joan Lomas, ?, Lily Sutcliffe, Mavis Smith nee Sunderland. The organisation, formed during the war and run by Mrs Kilner, had a reunion every year until 2014, when only 6 attended. Mrs Kilner is pictured standing behind the cake and wearing a dark, striped blouse.",Unknown,"Pennine Horizons Digital Archive","Pennine Horizons Digital Archive","1992, 1990s","Dianne Harwood","PHDA - Dianne Harwood Collection","Pennine Horizons Digital Archive","TIFF file 8-bit","English (U.K.)","Documentary photograph",DAH00143.tif,,,,,,,,,,,,,,,,,,,,,,,,,,,,,,,,,,,,"1940s,Celebration,Event,Events,Group,People",https://penninehorizons.org/files/original/e85a8c3663ec151528518bca59f0fc69.jpg,"Still Image","Dianne Harwood collection",1,0
11110,https://penninehorizons.org/items/show/11110,"View over Todmorden - BIM00293","Buildings, Houses, Mill, Mills, Mons Mill, Places, Stoodley Pike, Todmorden, Valley","Mons Mill, Todmorden was a cotton spinning mill in Todmorden, Calderdale, West Yorkshire for the Hare Spinning Company Limited. It was built in 1907, but ran into financial difficulties. It passed over to the Mons Mill (1919) Co Ltd and then was taken over by the Lancashire Cotton Corporation in the 1930s and passed to Courtaulds in 1964 and production stopped in 1968. It was used into the 1990s by Ward & Goldestone Ltd. The site was cleared in 2000.","Bill Marsden","Bill Marsden","Pennine Horizons Digital Archive",1990s,,"PHDA - Bill Marsden Collection","Pennine Horizons Digital Archive","TIFF file 8-bit","English (U.K.)","Documentary photograph",BIM00293.tif,Todmorden,,,,,,,,,,,,,,,,,,,,,,,,,,,,,,,,,,,"Buildings,Houses,Mill,Mills,Mons Mill,Stoodley Pike,Todmorden,Valley",https://penninehorizons.org/files/original/93dea550e8779ce09a4e9f1b73c3b34c.jpg,"Still Image","Bill Marsden collection",1,0
10997,https://penninehorizons.org/items/show/10997,"view over Todmorden - BIM00180","Buildings, Co-operative  Building, Demolition, Places, Todmorden, Transport","August 2000","Bill Marsden","Bill Marsden","Pennine Horizons Digital Archive",1990s,,"PHDA - Bill Marsden Collection","Pennine Horizons Digital Archive","TIFF file 8-bit","English (U.K.)","Documentary photograph",BIM00180.tif,"Hebden Bridge",,,,,,,,,,,,,,,,,,,,,,,,,,,,,,,,,,,"Buildings,Co-operative  Building,Demolition,Todmorden,Transport",https://penninehorizons.org/files/original/7376fe76b76885e5eec49c11766bb663.jpg,"Still Image","Bill Marsden collection",1,0
10981,https://penninehorizons.org/items/show/10981,"View over Todmorden - BIM00164","Buildings, Places, Todmorden, Town Hall, Viaduct","Showing Todmorden Town Hall and the ralway viaduct.","Bill Marsden","Bill Marsden","Pennine Horizons Digital Archive",1990s,,"PHDA - Bill Marsden Collection","Pennine Horizons Digital Archive","TIFF file 8-bit","English (U.K.)","Documentary photograph",BIM00164.tif,"Hebden Bridge",,,,,,,,,,,,,,,,,,,,,,,,,,,,,,,,,,,"Buildings,Todmorden,Town Hall,Viaduct",https://penninehorizons.org/files/original/b2052513c97285a12181ec3c600f5ff4.jpg,"Still Image","Bill Marsden collection",1,0
11067,https://penninehorizons.org/items/show/11067,"View over Mytholmroyd - BIM00250","Calder High School, Moderna, Mytholmroyd, Mytholmroyd Cricket Club, Places, River, River Calder, School, Scout Road, Street Names",,"Bill Marsden","Bill Marsden","Pennine Horizons Digital Archive",1990s,,"PHDA - Bill Marsden Collection","Pennine Horizons Digital Archive","TIFF file 8-bit","English (U.K.)","Documentary photograph",BIM00250.tif,Mytholmroyd,,,,,,,,,,,,,,,,,,,,,,,,,,,,,,,,,,,"Calder High School,Moderna,Mytholmroyd,Mytholmroyd Cricket Club,River,River Calder,School,Scout Road,Street Names",https://penninehorizons.org/files/original/87448ce9d4f3e757cd1037c4e8360bb9.jpg,"Still Image","Bill Marsden collection",1,0
11054,https://penninehorizons.org/items/show/11054,"View over Mytholmroyd - BIM00237","Colour, Mytholmroyd, Places, Valley",,"Bill Marsden","Bill Marsden","Pennine Horizons Digital Archive",1990s,,"PHDA - Bill Marsden Collection","Pennine Horizons Digital Archive","TIFF file 8-bit","English (U.K.)","Documentary photograph",BIM00237.tif,Mytholmroyd,,,,,,,,,,,,,,,,,,,,,,,,,,,,,,,,,,,"Colour,Mytholmroyd,Valley",https://penninehorizons.org/files/original/87d277e1db6f65fe6d5942830e92d494.jpg,"Still Image","Bill Marsden collection",1,0
11007,https://penninehorizons.org/items/show/11007,"View over Mytholmroyd - BIM00190","Canal, Canals, Mytholmroyd, Places, Railway, Railways, River, River Calder, Transport","The River Calder snakes its way through the picture, with the Rochdale Canal on the left initially and then on the right. Note the funfare in the Community Centre carpark.","Bill Marsden","Bill Marsden","Pennine Horizons Digital Archive",1990s,,"PHDA - Bill Marsden Collection","Pennine Horizons Digital Archive","TIFF file 8-bit","English (U.K.)","Documentary photograph",BIM00190.tif,"Hebden Bridge",,,,,,,,,,,,,,,,,,,,,,,,,,,,,,,,,,,"Canal,Mytholmroyd,Railway,Railways,River,River Calder,Transport",https://penninehorizons.org/files/original/b60625251aae63848e0a1166f0ba2de7.jpg,"Still Image","Bill Marsden collection",1,0
11006,https://penninehorizons.org/items/show/11006,"View over Mytholmroyd - BIM00189","Canal, Canals, Mytholmroyd, Places, Transport, Valley","Moderna Trading Estate in the foreground, and Calder High School centre right","Bill Marsden","Bill Marsden","Pennine Horizons Digital Archive",1990s,,"PHDA - Bill Marsden Collection","Pennine Horizons Digital Archive","TIFF file 8-bit","English (U.K.)","Documentary photograph",BIM00189.tif,"Hebden Bridge",,,,,,,,,,,,,,,,,,,,,,,,,,,,,,,,,,,"Canal,Mytholmroyd,Transport,Valley",https://penninehorizons.org/files/original/0ed5117daafbb872fc61abf901a9bf40.jpg,"Still Image","Bill Marsden collection",1,0
