﻿"Item Id","Item URI","Dublin Core:Title","Dublin Core:Subject","Dublin Core:Description","Dublin Core:Creator","Dublin Core:Source","Dublin Core:Publisher","Dublin Core:Date","Dublin Core:Contributor","Dublin Core:Rights","Dublin Core:Relation","Dublin Core:Format","Dublin Core:Language","Dublin Core:Type","Dublin Core:Identifier","Dublin Core:Coverage","Item Type Metadata:Lesson Plan Text","Item Type Metadata:Bibliography","Item Type Metadata:Biographical Text","Item Type Metadata:Occupation","Item Type Metadata:Death Date","Item Type Metadata:Birthplace","Item Type Metadata:Birth Date","Item Type Metadata:Participants","Item Type Metadata:Event Type","Item Type Metadata:URL","Item Type Metadata:Bit Rate/Frequency","Item Type Metadata:Interviewer","Item Type Metadata:Interviewee","Item Type Metadata:Location","Item Type Metadata:Transcription","Item Type Metadata:Local URL","Item Type Metadata:Original Format","Item Type Metadata:Physical Dimensions","Item Type Metadata:Duration","Item Type Metadata:Compression","Item Type Metadata:Producer","Item Type Metadata:Director","Item Type Metadata:Text","Item Type Metadata:Time Summary","Item Type Metadata:Email Body","Item Type Metadata:Subject Line","Item Type Metadata:From","Item Type Metadata:To","Item Type Metadata:CC","Item Type Metadata:BCC","Item Type Metadata:Number of Attachments","Item Type Metadata:Standards","Item Type Metadata:Objectives","Item Type Metadata:Materials",tags,file,itemType,collection,public,featured
13226,https://penninehorizons.org/items/show/13226,"Hebden Bridge - View of the Town from Fairfield. - ALC00406","Banks, Baptist Chapel, Birchcliffe, Buildings, Calder Holmes, Church, Churches & Chapels, Churches_&_Chapels, Co-operative  Building, Cross_Lanes_Chapel, Crossley Mill, Foster  Mill, General View, Hebden Bridge, Hope Baptist Chapel, Houses, Hurst Road, Keighley Road, Mill, Mill Chimney, Mills, Minster, Nursery Nook, Nutclough Mill, Parks, Places, Street Names, Zion Baptist Chapel","ALC00406. View of the town and its mills c.1895.  Behind Hope Baptist Chapel the large Co-Op Bulding and clock tower completed 1889 but looking left from it the Council Offices (1896) not yet built. Just visible lower right are railway wagons in the sidings and above them Crossley Mill.",,"Pennine Horizons Digital Archive","Pennine Horizons Digital Archive",2011-12-06T17:34:41Z,,"PHDA - Alice Longstaff Collection","Pennine Horizons Digital Archive","TIFF file 8-bit","English (U.K.)","Documentary photograph",ALC00406.tif,,,,,,,,,,,,,,,,,,,,,,,,,,,,,,,,,,,,"Banks,Baptist Chapel,Birchcliffe,Buildings,Calder Holmes,Church,Churches and Chapels,Co-operative  Building,Cross_Lanes_Chapel,Crossley Mill,Foster  Mill,General View,Hebden Bridge,Hope Baptist Chapel,Houses,Hurst Road,Keighley Road,Mill,Mill chimney,Mills,Minster,Nursery Nook,Nutclough Mill,Parks,Street Names,Zion Baptist Chapel",https://penninehorizons.org/files/original/1b5e880500a762e1aec41f0391374762.jpg,"Still Image","Alice Longstaff -  Gallery collection",1,0
13227,https://penninehorizons.org/items/show/13227,"Hebden Bridge - General Town View. - ALC00407","Banks, Baptist Chapel, Birchcliffe, Birchcliffe Road, Buildings, Canal, Canals, Church, Churches & Chapels, Churches_&_Chapels, Co-operative  Building, Foster  Mill, General View, Hebden Bridge, Holme House, Holme Street, Hope Baptist Chapel, Houses, Keighley Road, Mill, Mill Chimney, Mills, Minster, Nursery Nook, Nutclough Mill, Old Town, Places, Rochdale Canal, Street Names, Stubbings School, Transport","ALC00407. General town view c.1900. The new Birchcliffe Baptist Chapel (1899) just visible on the righthand hillside above Stubbings School but Riverside School (1908/9) being built on the land above the houses in the foreground. The Council Offices visible in the centre of the photo.",,"Pennine Horizons Digital Archive","Pennine Horizons Digital Archive",2011-12-06T17:46:19Z,,"PHDA - Alice Longstaff Collection","Pennine Horizons Digital Archive","TIFF file 8-bit","English (U.K.)","Documentary photograph",ALC00407.tif,,,,,,,,,,,,,,,,,,,,,,,,,,,,,,,,,,,,"Banks,Baptist Chapel,Birchcliffe,Birchcliffe Road,Buildings,Canal,Church,Churches and Chapels,Co-operative  Building,Foster  Mill,General View,Hebden Bridge,Holme House,Holme Street,Hope Baptist Chapel,Houses,Keighley Road,Mill,Mill chimney,Mills,Minster,Nursery Nook,Nutclough Mill,Old Town,Rochdale Canal,Street Names,Stubbings School,Transport",https://penninehorizons.org/files/original/f18aed0ac47cb27b9a6f0bc709a76eea.jpg,"Still Image","Alice Longstaff -  Gallery collection",1,0
13228,https://penninehorizons.org/items/show/13228,"Hebden Bridge - General View 1910. - ALC00408","Buildings, Catholic Church, Church, Churches & Chapels, Churches_&_Chapels, General View, Hebden Bridge, Mill, Mill Chimney, Mills, Minster, Pallis House, Places","ALC00408.  Centre foreground the Catholic Church of St Thomas of Canterbury, opened 1896 and next to it Pallis or by then Palace House. Above the Church is a tram on New Road. The Halifax Corporation trams reached Hebden Bridge in 1901.",,"Pennine Horizons Digital Archive","Pennine Horizons Digital Archive",2011-12-06T17:57:23Z,,"PHDA - Alice Longstaff Collection","Pennine Horizons Digital Archive","TIFF file 8-bit","English (U.K.)","Documentary photograph",ALC00408.tif,,,,,,,,,,,,,,,,,,,,,,,,,,,,,,,,,,,,"Buildings,Catholic Church,Church,Churches and Chapels,General View,Hebden Bridge,Mill,Mill chimney,Mills,Minster,Pallis House",https://penninehorizons.org/files/original/4fe53a5fd90450d15ef2e41e35a5d540.jpg,"Still Image","Alice Longstaff -  Gallery collection",1,0
13229,https://penninehorizons.org/items/show/13229,"Hebden Bridge - General View. - ALC00409","Banks, Baptist Chapel, Birchcliffe, Black and White Cafe, Buildings, Calder Holmes, Canal, Canals, Church, Churches & Chapels, Churches_&_Chapels, Co-operative  Building, General View, Hebden Bridge, Hope Baptist Chapel, Keighley Road, Mill, Mill Chimney, Mills, Minster, Parks, Places, Riverside School, Rochdale Canal, School, Schools, Street Names, Stubbings School, Transport, West End Bridge, Zion Baptist Chapel","ALC00409. In the foreground is Riverside School , opened in 1909. The the building on what is now the Memorial Gardens is the black and white cafe.",,"Pennine Horizons Digital Archive","Pennine Horizons Digital Archive",2011-12-06T17:59:48Z,,"PHDA - Alice Longstaff Collection","Pennine Horizons Digital Archive","TIFF file 8-bit","English (U.K.)","Documentary photograph",ALC00409.tif,,,,,,,,,,,,,,,,,,,,,,,,,,,,,,,,,,,,"Banks,Baptist Chapel,Birchcliffe,Black and White Cafe,Buildings,Calder Holmes,Canal,Church,Churches and Chapels,Co-operative  Building,General View,Hebden Bridge,Hope Baptist Chapel,Keighley Road,Mill,Mill chimney,Mills,Minster,Parks,Riverside School,Rochdale Canal,School,Schools,Street Names,Stubbings School,Transport,West End Bridge,Zion Baptist Chapel",https://penninehorizons.org/files/original/f08ce1ad8f9a6923b9ff30b34a9b4afd.jpg,"Still Image","Alice Longstaff -  Gallery collection",1,0
13230,https://penninehorizons.org/items/show/13230,"Hebden Bridge - General View. - ALC00410","Baptist Chapel, Buildings, Central Street, Church, Churches & Chapels, Churches_&_Chapels, Council Offices, Cross_Lanes_Chapel, General View, Hebden Bridge, Heptonstall Road, Hole in the Wall, Hurst Road, Keighley Road, Mill, Mills, Minster, Nursery Nook, Nutclough, Old Town, Old_Gate, Places, Public Houses, Pubs Inns & Hotels, Riverside School, School, Schools, Sport and Recreation, Street Names, Taverns, West End Bridge","ALC00410. Date unknown, early 20th century.",,"Pennine Horizons Digital Archive","Pennine Horizons Digital Archive",2011-12-06T18:04:03,,"PHDA - Alice Longstaff Collection","Pennine Horizons Digital Archive","TIFF file 8-bit","English (U.K.)","Documentary photograph",ALC00410.tif,,,,,,,,,,,,,,,,,,,,,,,,,,,,,,,,,,,,"Baptist Chapel,Buildings,Central Street,Church,Churches and Chapels,Council Offices,Cross_Lanes_Chapel,General View,Hebden Bridge,Heptonstall Road,Hole in the Wall,Hurst Road,Keighley Road,Mill,Mills,Minster,Nursery Nook,Nutclough,Old Town,Old_Gate,Public Houses,Pubs Inns and Hotels,Riverside School,School,Schools,Sport and recreation,Street Names,Taverns,West End Bridge",https://penninehorizons.org/files/original/170a48d63fc2dea1a08f7162fb3c2587.jpg,"Still Image","Alice Longstaff -  Gallery collection",1,0
13231,https://penninehorizons.org/items/show/13231,"Hebden Bridge - General View. - ALC00411","Buildings, Calder Mill, Church, Churches & Chapels, Churches_&_Chapels, General View, Hangingroyd Road, Hebden Bridge, Heptonstall Road, Houses, Methodist, Mill, Mills, Minster, Places, Salem Chapel, Salem Mill, Street Names, Stubbings School, Wesleyan Chapel, Zion Baptist Chapel","General view from above the town, date unknown but pre-1960.","Frith Ltd","Pennine Horizons Digital Archive","Pennine Horizons Digital Archive",2011-12-06T18:10:31Z,,"PHDA - Alice Longstaff Collection","Pennine Horizons Digital Archive","TIFF file 8-bit","English (U.K.)","Documentary photograph",ALC00411.tif,,,,,,,,,,,,,,,,,,,,,,,,,,,,,,,,,,,,"Buildings,Calder Mill,Church,Churches and Chapels,General View,Hangingroyd Road,Hebden Bridge,Heptonstall Road,Houses,Methodist,Mill,Mills,Minster,Salem Chapel,Salem Mill,Street Names,Stubbings School,Wesleyan Chapel,Zion Baptist Chapel",https://penninehorizons.org/files/original/5ee19d21584d37b71e4152cccf6c4f1f.jpg,"Still Image","Alice Longstaff -  Gallery collection",1,0
13232,https://penninehorizons.org/items/show/13232,"Hebden Bridge - General View - ALC00412","Aqueduct, Baptist Chapel, Birchcliffe, Bridge, Buildings, Canal, Canals, Central Street, Church, Churches & Chapels, Churches_&_Chapels, Co-operative  Building, Council Offices, Crossley Mill, Dodnaze, Hebden Bridge, Hebden Water, Hope Baptist Chapel, Keighley Road, Lock, Memorial Gardens, Mill, Mills, Minster, Old Bridge, Picture House, Places, River, Riverside School, Rochdale Canal, Salem Mill, School, Schools, St Georges Bridge, St Johns, Street Names, Stubbings School, Towpath, Transport, West End Bridge, Zion Baptist Chapel","Date unknown but probably late 1940s/early 1950s as the first steel pre-fabricated houses at Dodnaze on Wadsworth Lane can be seen. Central Street and Riverside Schools feature prominently","Lilywhite Ltd. Brighouse","Pennine Horizons Digital Archive","Pennine Horizons Digital Archive",1950s,,"PHDA - Alice Longstaff Collection","Pennine Horizons Digital Archive","TIFF file 8-bit","English (U.K.)","Documentary photograph",ALC00412.tif,,,,,,,,,,,,,,,,,,,,,,,,,,,,,,,,,,,,"Aqueduct,Baptist Chapel,Birchcliffe,Bridge,Buildings,Canal,Central Street,Church,Churches and Chapels,Co-operative  Building,Council Offices,Crossley Mill,Dodnaze,Hebden Bridge,Hebden Water,Hope Baptist Chapel,Keighley Road,Lock,Memorial Gardens,Mill,Mills,Minster,Old Bridge,Picture House,River,Riverside School,Rochdale Canal,Salem Mill,School,Schools,St Georges Bridge,St Johns,Street Names,Stubbings School,Towpath,Transport,West End Bridge,Zion Baptist Chapel",https://penninehorizons.org/files/original/0c2ccae9085fa8acdbe71208a47dcd0d.jpg,"Still Image","Alice Longstaff -  Gallery collection",1,0
13233,https://penninehorizons.org/items/show/13233,"Hebden Bridge - View from Wood Top, c1900 - ALC00413","Baptist Chapel, Buildings, Calder Holmes, Canal, Canals, Church, Churches & Chapels, Churches_&_Chapels, Crossley Mill, Crow Nest, Gas Works, General View, Goods Yard, Hebden Bridge, Holme House, Hope Baptist Chapel, Lancashire & Yorkshire Railway, Mayroyd, Mayroyd Mill, Mill, Mills, Minster, Parks, Places, Princes Bridge, Railway, Railway Warehouse, Railways, Rochdale Canal, Royd House, Station, Station Road, Transport","View across the railway station to the town. The passenger station, re-built 1891/2, wedged between Victoria Mill to its right and the large railway warehouse to the left and beyond it Crossley Mill. Bottom right the Crow Nest Works of the joint Hebden Bridge and Mytholmroyd Gas Board.",,"Pennine Horizons Digital Archive","Pennine Horizons Digital Archive","2011-12-07T10:56:33 , 1900s",,"PHDA - Alice Longstaff Collection","Pennine Horizons Digital Archive","TIFF file 8-bit","English (U.K.)","Documentary photograph",ALC00413.tif,,,,,,,,,,,,,,,,,,,,,,,,,,,,,,,,,,,,"#Hebden Bridge Station,Baptist Chapel,Buildings,Calder Holmes,Canal,Church,Churches and Chapels,Crossley Mill,Crow Nest,Gas Works,General View,Goods Yard,Hebden Bridge,Holme House,Hope Baptist Chapel,Lancashire and Yorkshire Railway,Mayroyd,Mayroyd Mill,Mill,Mills,Minster,Parks,Princes Bridge,Railway,Railway Warehouse,Railways,Rochdale Canal,Royd House,Station,Station Road,Transport",https://penninehorizons.org/files/original/2869a791b85ae6543261ba57698f48cc.jpg,"Still Image","Alice Longstaff -  Gallery collection",1,0
13234,https://penninehorizons.org/items/show/13234,"Hebden Bridge - View from Wood Top. - ALC00414","Baptist Chapel, Buildings, Calder Holmes, Canal, Canals, Church, Churches & Chapels, Churches_&_Chapels, Crossley Mill, Gas Works, General View, Goods Yard, Hebden Bridge, Holme House, Hope Baptist Chapel, Lancashire & Yorkshire Railway, Lello, Mayroyd, Mill, Mills, Minster, Parks, Places, Princes Bridge, Railway, Railway Warehouse, Railways, Riverside School, Road, Rochdale Canal, Royd House, School, Schools, Station, Station Road, Transport","Bottom centre the passenger station and to its left the large railway warehouse and goods sidings. Above them can be seen Riverside School, originally Hebden Bridge Grammar School which opened 1909. At the top of Station Road by Princes Bridge is Dora Lello's sweet shop and opposite it the gate which marked the contentious boundary of the railway company's responsibility.",,"Pennine Horizons Digital Archive","Pennine Horizons Digital Archive",2011-12-07T10:57:25Z,,"PHDA - Alice Longstaff Collection","Pennine Horizons Digital Archive","TIFF file 8-bit","English (U.K.)","Documentary photograph",ALC00414.tif,,,,,,,,,,,,,,,,,,,,,,,,,,,,,,,,,,,,"#Hebden Bridge Station,Baptist Chapel,Buildings,Calder Holmes,Canal,Church,Churches and Chapels,Crossley Mill,Gas Works,General View,Goods Yard,Hebden Bridge,Holme House,Hope Baptist Chapel,Lancashire and Yorkshire Railway,Lello,Mayroyd,Mill,Mills,Minster,Parks,Princes Bridge,Railway,Railway Warehouse,Railways,Riverside School,Road,Rochdale Canal,Royd House,School,Schools,Station,Station Road,Transport",https://penninehorizons.org/files/original/3883df44ec3d932960b79f8d95a4f1aa.jpg,"Still Image","Alice Longstaff -  Gallery collection",1,0
13236,https://penninehorizons.org/items/show/13236,"Hebden Bridge - Moss Lane. - ALC00416","Church, Churches & Chapels, Churches_&_Chapels, General View, Hebden Bridge, Heptonstall, Houses, Minster, Moss Lane, Places, Street Names","ALC00416. c.1910. Moss Lane climbing the hillside to Cross Lanes. Named after the Moss family, early fustian manufacturers, one of whom had a school here on the hillside which is now built up. On the skyline the top of Heptonstall Church. The house in the middle is Angeldale.",,"Pennine Horizons Digital Archive","Pennine Horizons Digital Archive",2011-12-07T14:51:43,,"PHDA - Alice Longstaff Collection","Pennine Horizons Digital Archive","TIFF file 8-bit","English (U.K.)","Documentary photograph",ALC00416.tif,,,,,,,,,,,,,,,,,,,,,,,,,,,,,,,,,,,,"Church,Churches and Chapels,General View,Hebden Bridge,Heptonstall,Houses,Minster,Moss Lane,Street Names",https://penninehorizons.org/files/original/544a71861267bc862a3d8acbc09bcd81.jpg,"Still Image","Alice Longstaff -  Gallery collection",1,0
13298,https://penninehorizons.org/items/show/13298,"View over Hebden Bridge - ALC00476","Birchcliffe, Birchcliffe Baptist Chapel, Buildings, Churches_&_Chapels, Foster Lane, Foster Mill, Hebden Bridge, Mill, Mills, Street Names","General view over Woodend, Nutclough and Birchcliffe. View over Hebden Bridge with Foster Mill and Foster Lane Chapel on the right and above them Nutclough Mill. On the far hillside is the old Birchcliffe Chapel. Heptonstall Road is on the left.",,"Pennine Horizons Digital Archive","Pennine Horizons Digital Archive","No date yet",,"PHDA - Alice Longstaff Collection","Pennine Horizons Digital Archive","TIFF file 8-bit","English (U.K.)","Documentary photograph",ALC00476.tif,,,,,,,,,,,,,,,,,,,,,,,,,,,,,,,,,,,,"Birchcliffe,Birchcliffe Baptist Chapel,Buildings,Churches and Chapels,Foster Lane,Foster Mill,Hebden Bridge,Mill,Mills,Street Names",https://penninehorizons.org/files/original/ed9023c4a7c6b6e0e85ee1653a08486b.jpg,"Still Image","Alice Longstaff - General Pictures",1,0
13299,https://penninehorizons.org/items/show/13299,"Birchcliffe Baptist Chapel, Hebden Bridge. - ALC00477","Baptist Chapel, Birchcliffe, Birchcliffe Chapel, Church, Churches & Chapels, Churches_&_Chapels, Hebden Bridge, Minster, Places","Harvest Festival, but does anyone know the year?",,"Pennine Horizons Digital Archive","Pennine Horizons Digital Archive","No date yet","Formerly BT210HU.","PHDA - Alice Longstaff Collection","Pennine Horizons Digital Archive","TIFF file 8-bit","English (U.K.)","Documentary photograph",ALC00477.TIF,,,,,,,,,,,,,,,,,,,,,,,,,,,,,,,,,,,,"Baptist Chapel,Birchcliffe,Birchcliffe Chapel,Church,Churches and Chapels,Hebden Bridge,Minster",https://penninehorizons.org/files/original/4fe53e07b86c5f71db5cbc3ee20e12cc.jpg,"Still Image","Alice Longstaff - General Pictures",1,0
13300,https://penninehorizons.org/items/show/13300,"Birchcliffe Chapel - ALC00478","Birchcliffe, Birchcliffe Chapel, Church, Churches & Chapels, Churches_&_Chapels, Hebden Bridge, Minster, Places","Formerly BT211HU.",,"Pennine Horizons Digital Archive","Pennine Horizons Digital Archive","No date yet",,"PHDA - Alice Longstaff Collection","Pennine Horizons Digital Archive","TIFF file 8-bit","English (U.K.)","Documentary photograph",ALC00478.TIF,,,,,,,,,,,,,,,,,,,,,,,,,,,,,,,,,,,,"Birchcliffe,Birchcliffe Chapel,Church,Churches and Chapels,Hebden Bridge,Minster",https://penninehorizons.org/files/original/6def9429a253965ba1edd52a9b9f655a.jpg,"Still Image","Alice Longstaff - General Pictures",1,0
13301,https://penninehorizons.org/items/show/13301,"The Organ of Birchcliffe Chapel - ALC00479","Baptist Chapel, Birchcliffe Chapel, Church, Churches & Chapels, Churches_&_Chapels, Hebden Bridge, Interior, Minster, Organ, Places",,,"Pennine Horizons Digital Archive","Pennine Horizons Digital Archive","No date yet","Formerly BT213HU.","PHDA - Alice Longstaff Collection","Pennine Horizons Digital Archive","TIFF file 8-bit","English (U.K.)","Documentary photograph",ALC00479.TIF,,,,,,,,,,,,,,,,,,,,,,,,,,,,,,,,,,,,"Baptist Chapel,Birchcliffe Chapel,Church,Churches and Chapels,Hebden Bridge,Interior,Minster,Organ",https://penninehorizons.org/files/original/623700e81e8c969c2eccaf45bc9f859b.jpg,"Still Image","Alice Longstaff - General Pictures",1,0
13302,https://penninehorizons.org/items/show/13302,"Birchcliffe Chapel, c1898 - ALC00480","Birchcliffe, Birchcliffe Chapel, Church, Churches & Chapels, Churches_&_Chapels, Hebden Bridge, Interior, Minster, Places","Formerly BT214HU.",,"Pennine Horizons Digital Archive","Pennine Horizons Digital Archive",1890s,,"PHDA - Alice Longstaff Collection","Pennine Horizons Digital Archive","TIFF file 8-bit","English (U.K.)","Documentary photograph",ALC00480.TIF,,,,,,,,,,,,,,,,,,,,,,,,,,,,,,,,,,,,"Birchcliffe,Birchcliffe Chapel,Church,Churches and Chapels,Hebden Bridge,Interior,Minster",https://penninehorizons.org/files/original/7640c4f4cba3a9330937efe49f1954bc.jpg,"Still Image","Alice Longstaff - General Pictures",1,0
13303,https://penninehorizons.org/items/show/13303,"Birchcliffe Chapel - ALC00481","Birchcliffe, Birchcliffe Chapel, Church, Churches & Chapels, Churches_&_Chapels, Hebden Bridge, Interior, Minster, Places","Birchcliffe Baptist Chapel, probably ready for its opening on 31st October 1899. It closed as a chapel in February 1974 and was bought by the Joseph Rowntree Social Services Trust. A floor was built across at balcony level to provide an upper storey. Ref: BT220.",,"Pennine Horizons Digital Archive","Pennine Horizons Digital Archive","No date yet",,"PHDA - Alice Longstaff Collection","Pennine Horizons Digital Archive","TIFF file 8-bit","English (U.K.)","Documentary photograph",ALC00481.TIF,,,,,,,,,,,,,,,,,,,,,,,,,,,,,,,,,,,,"Birchcliffe,Birchcliffe Chapel,Church,Churches and Chapels,Hebden Bridge,Interior,Minster",https://penninehorizons.org/files/original/e4e522a88f5635645f2ad80ff3747e8e.jpg,"Still Image","Alice Longstaff - General Pictures",1,0
13304,https://penninehorizons.org/items/show/13304,"Birchcliffe Chapel, Hebden Bridge - ALC00482","Baptist Chapel, Birchcliffe, Church, Churches & Chapels, Churches_&_Chapels, Hebden Bridge, Interior, Minster, Places, Pulpit","Birchcliffe Baptist Chapel, probably ready for its opening on 31st October 1899. It closed as a chapel in February 1974 and was bought by the Joseph Rowntree Social Services Trust. A floor was built across at balcony level to provide an upper storey.",,"Pennine Horizons Digital Archive","Pennine Horizons Digital Archive","No date yet","Ref: BT221. ZZ40","PHDA - Alice Longstaff Collection","Pennine Horizons Digital Archive","TIFF file 8-bit","English (U.K.)","Documentary photograph",ALC00482.TIF,,,,,,,,,,,,,,,,,,,,,,,,,,,,,,,,,,,,"Baptist Chapel,Birchcliffe,Church,Churches and Chapels,Hebden Bridge,Interior,Minster,Pulpit",https://penninehorizons.org/files/original/bfc6d55a632a69a6bc6865aa7f50ea67.jpg,"Still Image","Alice Longstaff - General Pictures",1,0
13308,https://penninehorizons.org/items/show/13308,"The Old Birchcliffe Chapel - ALC00486","Birchcliffe, Birchcliffe Chapel, Church, Churches & Chapels, Churches_&_Chapels, Hebden Bridge, Minster","The old Birchcliffe Baptist Chapel. Some of the stone was later used to build a Sunday School located behind the 'new' chapel which opened in 1898.",,"Pennine Horizons Digital Archive","Pennine Horizons Digital Archive","No date yet","Formerly CT135.","PHDA - Alice Longstaff Collection","Pennine Horizons Digital Archive","TIFF file 8-bit","English (U.K.)","Documentary photograph",ALC00486.tif,,,,,,,,,,,,,,,,,,,,,,,,,,,,,,,,,,,,"Birchcliffe,Birchcliffe Chapel,Church,Churches and Chapels,Hebden Bridge,Minster",https://penninehorizons.org/files/original/d07ba00508c40bbd88ec1a11ed9e5160.jpg,"Still Image","Alice Longstaff - General Pictures",1,0
13309,https://penninehorizons.org/items/show/13309,"Birchcliffe Chapel, Hebden Bridge - ALC00487","Birchcliffe Chapel, Church, Churches & Chapels, Churches_&_Chapels, Hebden Bridge, Minster, Places",,,"Pennine Horizons Digital Archive","Pennine Horizons Digital Archive","No date yet",,"PHDA - Alice Longstaff Collection","Pennine Horizons Digital Archive","TIFF file 8-bit","English (U.K.)","Documentary photograph",ALC00487.TIF,,,,,,,,,,,,,,,,,,,,,,,,,,,,,,,,,,,,"Birchcliffe Chapel,Church,Churches and Chapels,Hebden Bridge,Minster",https://penninehorizons.org/files/original/940ca32cb0a88dd2a7abda91b7223fed.jpg,"Still Image","Alice Longstaff - General Pictures",1,0