﻿"Item Id","Item URI","Dublin Core:Title","Dublin Core:Subject","Dublin Core:Description","Dublin Core:Creator","Dublin Core:Source","Dublin Core:Publisher","Dublin Core:Date","Dublin Core:Contributor","Dublin Core:Rights","Dublin Core:Relation","Dublin Core:Format","Dublin Core:Language","Dublin Core:Type","Dublin Core:Identifier","Dublin Core:Coverage","Item Type Metadata:Lesson Plan Text","Item Type Metadata:Bibliography","Item Type Metadata:Biographical Text","Item Type Metadata:Occupation","Item Type Metadata:Death Date","Item Type Metadata:Birthplace","Item Type Metadata:Birth Date","Item Type Metadata:Participants","Item Type Metadata:Event Type","Item Type Metadata:URL","Item Type Metadata:Bit Rate/Frequency","Item Type Metadata:Interviewer","Item Type Metadata:Interviewee","Item Type Metadata:Location","Item Type Metadata:Transcription","Item Type Metadata:Local URL","Item Type Metadata:Original Format","Item Type Metadata:Physical Dimensions","Item Type Metadata:Duration","Item Type Metadata:Compression","Item Type Metadata:Producer","Item Type Metadata:Director","Item Type Metadata:Text","Item Type Metadata:Time Summary","Item Type Metadata:Email Body","Item Type Metadata:Subject Line","Item Type Metadata:From","Item Type Metadata:To","Item Type Metadata:CC","Item Type Metadata:BCC","Item Type Metadata:Number of Attachments","Item Type Metadata:Standards","Item Type Metadata:Objectives","Item Type Metadata:Materials",tags,file,itemType,collection,public,featured
27146,https://penninehorizons.org/items/show/27146,"Demolition of Todmorden Co-op, Dale Street, Todmorden, 2000 - TAL00187","Building, Co-op Building, Co-operative Movement, Demolition, Todmorden","AN 34131981",,"Todmorden Antiquarian Society","Pennine Horizons Digital Archive",2000,,"PHDA - Todmorden Antiquarian Society","Pennine Horizons Digital Archive","TIFF file 8-bit","English (U.K.)","Documentary photograph",TAL00187.tif,,,,,,,,,,,,,,,,,,,,,,,,,,,,,,,,,,,,"Building,Co-op Building,Co-operative Movement,Demolition,Todmorden",https://penninehorizons.org/files/original/210dde573d6216d2d3d84cebeab163d0.jpg,"Still Image","Todmorden Antiquarian Society Photographs at the Library",1,0
27147,https://penninehorizons.org/items/show/27147,"Demolition of Todmorden Co-op, Dale Street, Todmorden, 2000 - TAL00188","Building, Co-op Building, Co-operative Movement, Demolition, Todmorden","AN 34131981",,"Todmorden Antiquarian Society","Pennine Horizons Digital Archive",2000,,"PHDA - Todmorden Antiquarian Society","Pennine Horizons Digital Archive","TIFF file 8-bit","English (U.K.)","Documentary photograph",TAL00188.tif,,,,,,,,,,,,,,,,,,,,,,,,,,,,,,,,,,,,"Building,Co-op Building,Co-operative Movement,Demolition,Todmorden",https://penninehorizons.org/files/original/911dd1f1f14fb6fbcdab126f82ba54a5.jpg,"Still Image","Todmorden Antiquarian Society Photographs at the Library",1,0
27148,https://penninehorizons.org/items/show/27148,"Demolition of Todmorden Co-op, Dale Street, Todmorden, 2000 - TAL00189","Building, Co-op Building, Co-operative Movement, Demolition, Todmorden","AN 34131981",,"Todmorden Antiquarian Society","Pennine Horizons Digital Archive",2000,,"PHDA - Todmorden Antiquarian Society","Pennine Horizons Digital Archive","TIFF file 8-bit","English (U.K.)","Documentary photograph",TAL00189.tif,,,,,,,,,,,,,,,,,,,,,,,,,,,,,,,,,,,,"Building,Co-op Building,Co-operative Movement,Demolition,Todmorden",https://penninehorizons.org/files/original/efcca1d121dc45a592202b4fd74c6c57.jpg,"Still Image","Todmorden Antiquarian Society Photographs at the Library",1,0
27149,https://penninehorizons.org/items/show/27149,"Todmorden Co-op, Dale Street, Todmorden - TAL00190","Building, Co-op Building, Co-operative Movement, Demolition, Todmorden","AN 34131981",,"Todmorden Antiquarian Society","Pennine Horizons Digital Archive",2000,,"PHDA - Todmorden Antiquarian Society","Pennine Horizons Digital Archive","TIFF file 8-bit","English (U.K.)","Documentary photograph",TAL00190.tif,,,,,,,,,,,,,,,,,,,,,,,,,,,,,,,,,,,,"Building,Co-op Building,Co-operative Movement,Demolition,Todmorden",https://penninehorizons.org/files/original/1d0b4984ec7e6a7da9f0cd35aad4772b.jpg,"Still Image","Todmorden Antiquarian Society Photographs at the Library",1,0
27150,https://penninehorizons.org/items/show/27150,"Demolition in 2000 of Todmorden Co-op, Dale Street, Todmorden. - TAL00191","Building, Co-op Building, Co-operative Movement, Demolition, Todmorden","AN 34131981",,"Todmorden Antiquarian Society","Pennine Horizons Digital Archive",2000,,"PHDA - Todmorden Antiquarian Society","Pennine Horizons Digital Archive","TIFF file 8-bit","English (U.K.)","Documentary photograph",TAL00191.tif,,,,,,,,,,,,,,,,,,,,,,,,,,,,,,,,,,,,"Building,Co-op Building,Co-operative Movement,Demolition,Todmorden",https://penninehorizons.org/files/original/e60834af1f05f074a1af02a0f653a689.jpg,"Still Image","Todmorden Antiquarian Society Photographs at the Library",1,0
27151,https://penninehorizons.org/items/show/27151,"Demolition in 2000 of Todmorden Co-op, Dale Street, Todmorden. - TAL00192","Building, Co-op Building, Co-operative Movement, Demolition, Todmorden","AN 34131981",,"Todmorden Antiquarian Society","Pennine Horizons Digital Archive",2000,,"PHDA - Todmorden Antiquarian Society","Pennine Horizons Digital Archive","TIFF file 8-bit","English (U.K.)","Documentary photograph",TAL00192.tif,,,,,,,,,,,,,,,,,,,,,,,,,,,,,,,,,,,,"Building,Co-op Building,Co-operative Movement,Demolition,Todmorden",https://penninehorizons.org/files/original/7f44e66cf8a3ef88ba25bcf1a4d5fe38.jpg,"Still Image","Todmorden Antiquarian Society Photographs at the Library",1,0
27152,https://penninehorizons.org/items/show/27152,"Demolition in 2000 of Todmorden Co-op, Dale Street, Todmorden. - TAL00193","Building, Co-op Building, Co-operative Movement, Demolition, Todmorden","AN 34131981",,"Todmorden Antiquarian Society","Pennine Horizons Digital Archive",2000,,"PHDA - Todmorden Antiquarian Society","Pennine Horizons Digital Archive","TIFF file 8-bit","English (U.K.)","Documentary photograph",TAL00193.tif,,,,,,,,,,,,,,,,,,,,,,,,,,,,,,,,,,,,"Building,Co-op Building,Co-operative Movement,Demolition,Todmorden",https://penninehorizons.org/files/original/4c9120fc357f600ae3ae95472d4b269a.jpg,"Still Image","Todmorden Antiquarian Society Photographs at the Library",1,0
27153,https://penninehorizons.org/items/show/27153,"Demolition in 2000 of Todmorden Co-op, Dale Street, Todmorden. - TAL00194","Building, Co-op Building, Co-operative Movement, Demolition, Todmorden","AN 34131981",,"Todmorden Antiquarian Society","Pennine Horizons Digital Archive",2000,,"PHDA - Todmorden Antiquarian Society","Pennine Horizons Digital Archive","TIFF file 8-bit","English (U.K.)","Documentary photograph",TAL00194.tif,,,,,,,,,,,,,,,,,,,,,,,,,,,,,,,,,,,,"Building,Co-op Building,Co-operative Movement,Demolition,Todmorden",https://penninehorizons.org/files/original/e25ae05d64ef62e2adb6d1d1aa29b365.jpg,"Still Image","Todmorden Antiquarian Society Photographs at the Library",1,0
27154,https://penninehorizons.org/items/show/27154,"Demolition in 2000 of Todmorden Co-op, Dale Street, Todmorden. - TAL00195","Building, Co-op Building, Co-operative Movement, Demolition, Todmorden","AN 34131981",,"Todmorden Antiquarian Society","Pennine Horizons Digital Archive",2000,,"PHDA - Todmorden Antiquarian Society","Pennine Horizons Digital Archive","TIFF file 8-bit","English (U.K.)","Documentary photograph",TAL00195.tif,,,,,,,,,,,,,,,,,,,,,,,,,,,,,,,,,,,,"Building,Co-op Building,Co-operative Movement,Demolition,Todmorden",https://penninehorizons.org/files/original/841e68f003f2604f966c8536069779e4.jpg,"Still Image","Todmorden Antiquarian Society Photographs at the Library",1,0
27155,https://penninehorizons.org/items/show/27155,"Demolition in 2000 of Todmorden Co-op, Dale Street, Todmorden. - TAL00196","Building, Co-op Building, Co-operative Movement, Demolition, Todmorden","AN 34131981",,"Todmorden Antiquarian Society","Pennine Horizons Digital Archive",2000,,"PHDA - Todmorden Antiquarian Society","Pennine Horizons Digital Archive","TIFF file 8-bit","English (U.K.)","Documentary photograph",TAL00196.tif,,,,,,,,,,,,,,,,,,,,,,,,,,,,,,,,,,,,"Building,Co-op Building,Co-operative Movement,Demolition,Todmorden",https://penninehorizons.org/files/original/3ecc5b6e2e68dac597591657141dcff8.jpg,"Still Image","Todmorden Antiquarian Society Photographs at the Library",1,0
27156,https://penninehorizons.org/items/show/27156,"Demolition in 2000 of Todmorden Co-op, Dale Street, Todmorden. - TAL00197","Building, Co-op Building, Co-operative Movement, Demolition, Todmorden","AN 34131981",,"Todmorden Antiquarian Society","Pennine Horizons Digital Archive",2000,,"PHDA - Todmorden Antiquarian Society","Pennine Horizons Digital Archive","TIFF file 8-bit","English (U.K.)","Documentary photograph",TAL00197.tif,,,,,,,,,,,,,,,,,,,,,,,,,,,,,,,,,,,,"Building,Co-op Building,Co-operative Movement,Demolition,Todmorden",https://penninehorizons.org/files/original/9fe70b0eed547f850cd9def7a4833afe.jpg,"Still Image","Todmorden Antiquarian Society Photographs at the Library",1,0
27157,https://penninehorizons.org/items/show/27157,"Demolition in 2000 of Todmorden Co-op, Dale Street, Todmorden. - TAL00198","Building, Co-op Building, Co-operative Movement, Demolition, Todmorden","AN 34131981",,"Todmorden Antiquarian Society","Pennine Horizons Digital Archive",2000,,"PHDA - Todmorden Antiquarian Society","Pennine Horizons Digital Archive","TIFF file 8-bit","English (U.K.)","Documentary photograph",TAL00198.tif,,,,,,,,,,,,,,,,,,,,,,,,,,,,,,,,,,,,"Building,Co-op Building,Co-operative Movement,Demolition,Todmorden",https://penninehorizons.org/files/original/00d345699def22261e2aa4fd5c6052dd.jpg,"Still Image","Todmorden Antiquarian Society Photographs at the Library",1,0
27158,https://penninehorizons.org/items/show/27158,"Devil's Rock, Blackshaw Head - TAL00199","Blackshaw Head, Great Rock, Places","AN 70082767",,"Todmorden Antiquarian Society","Pennine Horizons Digital Archive",,,"PHDA - Todmorden Antiquarian Society","Pennine Horizons Digital Archive","TIFF file 8-bit","English (U.K.)","Documentary photograph",TAL00199.tif,,,,,,,,,,,,,,,,,,,,,,,,,,,,,,,,,,,,"Blackshaw Head,Great Rock,Places",https://penninehorizons.org/files/original/120dc525e6a861fc574397a946bdfc3a.jpg,"Still Image","Todmorden Antiquarian Society Photographs at the Library",1,0
27159,https://penninehorizons.org/items/show/27159,"Devil's Rock, Blackshaw Head - TAL00200","Blackshaw Head, Great Rock, Places","AN 70082767",,"Todmorden Antiquarian Society","Pennine Horizons Digital Archive",,,"PHDA - Todmorden Antiquarian Society","Pennine Horizons Digital Archive","TIFF file 8-bit","English (U.K.)","Documentary photograph",TAL00200.tif,,,,,,,,,,,,,,,,,,,,,,,,,,,,,,,,,,,,"Blackshaw Head,Great Rock,Places",https://penninehorizons.org/files/original/51f4ad84420ac57b67a1b2a33c04a2ca.jpg,"Still Image","Todmorden Antiquarian Society Photographs at the Library",1,0
27160,https://penninehorizons.org/items/show/27160,"Dobroyd Castle, Todmorden - TAL00201","Building, Dobroyd Castle, Todmorden","AN 70083401",,"Todmorden Antiquarian Society","Pennine Horizons Digital Archive",,,"PHDA - Todmorden Antiquarian Society","Pennine Horizons Digital Archive","TIFF file 8-bit","English (U.K.)","Documentary photograph",TAL00201.tif,,,,,,,,,,,,,,,,,,,,,,,,,,,,,,,,,,,,"Building,Dobroyd Castle,Todmorden",https://penninehorizons.org/files/original/b83f3af964840a0e20b2e4f3d959be2b.jpg,"Still Image","Todmorden Antiquarian Society Photographs at the Library",1,0
27161,https://penninehorizons.org/items/show/27161,"Dobroyd Castle, Todmorden - TAL00202","Building, Dobroyd Castle, Todmorden","AN 3413180X",,"Todmorden Antiquarian Society","Pennine Horizons Digital Archive",,,"PHDA - Todmorden Antiquarian Society","Pennine Horizons Digital Archive","TIFF file 8-bit","English (U.K.)","Documentary photograph",TAL00202.tif,,,,,,,,,,,,,,,,,,,,,,,,,,,,,,,,,,,,"Building,Dobroyd Castle,Todmorden",https://penninehorizons.org/files/original/3052f6ae454a1b092b8e7a22a02ebd26.jpg,"Still Image","Todmorden Antiquarian Society Photographs at the Library",1,0
27162,https://penninehorizons.org/items/show/27162,"Dobroyd Castle, Todmorden - TAL00203","Building, Dobroyd Castle, Todmorden","AN 3413180X",,"Todmorden Antiquarian Society","Pennine Horizons Digital Archive",,,"PHDA - Todmorden Antiquarian Society","Pennine Horizons Digital Archive","TIFF file 8-bit","English (U.K.)","Documentary photograph",TAL00203.tif,,,,,,,,,,,,,,,,,,,,,,,,,,,,,,,,,,,,"Building,Dobroyd Castle,Todmorden",https://penninehorizons.org/files/original/7d14f2677895522310998617f3fc301c.jpg,"Still Image","Todmorden Antiquarian Society Photographs at the Library",1,0
27163,https://penninehorizons.org/items/show/27163,"Dr Stella Henderson Brown, Mayor of Todmorden 1952-53 - TAL00204","Chain of Office, Mayor, Todmorden, Town Hall","AN 34131973",,"Todmorden Antiquarian Society","Pennine Horizons Digital Archive",1952,,"PHDA - Todmorden Antiquarian Society","Pennine Horizons Digital Archive","TIFF file 8-bit","English (U.K.)","Documentary photograph",TAL00204.tif,,,,,,,,,,,,,,,,,,,,,,,,,,,,,,,,,,,,"Chain of Office,Mayor,Todmorden,Town Hall",https://penninehorizons.org/files/original/86b7948ec147bc39fd7b5f0775fa0a4d.jpg,"Still Image","Todmorden Antiquarian Society Photographs at the Library",1,0
27164,https://penninehorizons.org/items/show/27164,"Dr Stella Henderson Brown, Mayor of Todmorden 1952-53 - TAL00205","Chain of Office, Mayor, Todmorden, Town Hall","AN 34131973",,"Todmorden Antiquarian Society","Pennine Horizons Digital Archive",1952,,"PHDA - Todmorden Antiquarian Society","Pennine Horizons Digital Archive","TIFF file 8-bit","English (U.K.)","Documentary photograph",TAL00205.tif,,,,,,,,,,,,,,,,,,,,,,,,,,,,,,,,,,,,"Chain of Office,Mayor,Todmorden,Town Hall",https://penninehorizons.org/files/original/a26768654901b225ae2228fe62a75c73.jpg,"Still Image","Todmorden Antiquarian Society Photographs at the Library",1,0
27165,https://penninehorizons.org/items/show/27165,"Eagle Crag, Cornholme, Todmorden - TAL00206","Cornholme, Eagle Crag, Places, Todmorden","AN 70083613",,"Todmorden Antiquarian Society","Pennine Horizons Digital Archive",,,"PHDA - Todmorden Antiquarian Society","Pennine Horizons Digital Archive","TIFF file 8-bit","English (U.K.)","Documentary photograph",TAL00206.tif,,,,,,,,,,,,,,,,,,,,,,,,,,,,,,,,,,,,"Cornholme,Eagle Crag,Places,Todmorden",https://penninehorizons.org/files/original/5c6cf4b92f6ccac427ebb5bf4189c7a2.jpg,"Still Image","Todmorden Antiquarian Society Photographs at the Library",1,0
27166,https://penninehorizons.org/items/show/27166,"Edge End Farm, Todmorden - TAL00207","Edge End Farm, Todmorden","AN 34131842","Robert Priestley","Todmorden Antiquarian Society","Pennine Horizons Digital Archive",,,"PHDA - Todmorden Antiquarian Society","Pennine Horizons Digital Archive","TIFF file 8-bit","English (U.K.)","Documentary photograph",TAL00207.tif,,,,,,,,,,,,,,,,,,,,,,,,,,,,,,,,,,,,"Edge End Farm,Todmorden",https://penninehorizons.org/files/original/c67e73a66b7f46921ea28bacdaf5ef98.jpg,"Still Image","Todmorden Antiquarian Society Photographs at the Library",1,0
27167,https://penninehorizons.org/items/show/27167,"Higher Ashes Farmhouse, Todmorden - TAL00208","Drawing, Higher Ashes, Todmorden","AN 34131942",,"Todmorden Antiquarian Society","Pennine Horizons Digital Archive",,,"PHDA - Todmorden Antiquarian Society","Pennine Horizons Digital Archive","TIFF file 8-bit","English (U.K.)","Documentary photograph",TAL00208.tif,,,,,,,,,,,,,,,,,,,,,,,,,,,,,,,,,,,,"Drawing,Higher Ashes,Todmorden",https://penninehorizons.org/files/original/c3243937d307510836b296fc62afe70e.jpg,"Still Image","Todmorden Antiquarian Society Photographs at the Library",1,0
27168,https://penninehorizons.org/items/show/27168,"Architectural Details of Various Local houses - TAL00209","Architecture, Drawing","AN 34131942",,"Todmorden Antiquarian Society","Pennine Horizons Digital Archive",,,"PHDA - Todmorden Antiquarian Society","Pennine Horizons Digital Archive","TIFF file 8-bit","English (U.K.)","Documentary photograph",TAL00209.tif,,,,,,,,,,,,,,,,,,,,,,,,,,,,,,,,,,,,"Architecture,Drawing",https://penninehorizons.org/files/original/6328dde005ab9ada6ea886900da08b58.jpg,"Still Image","Todmorden Antiquarian Society Photographs at the Library",1,0
27169,https://penninehorizons.org/items/show/27169,"Farrar and Crabtree, Cornholme - TAL00210","Cornholme, People at Work, Places, Textiles Manufacture","Mr Crabtree is in the foreground. Per (Photo by?) the late Mr F Anderson, 169 Manchester Road, Burnley who died in 1988.AN 55941158",,"Todmorden Antiquarian Society","Pennine Horizons Digital Archive",,,"PHDA - Todmorden Antiquarian Society","Pennine Horizons Digital Archive","TIFF file 8-bit","English (U.K.)","Documentary photograph",TAL00210.tif,,,,,,,,,,,,,,,,,,,,,,,,,,,,,,,,,,,,"Cornholme,People at Work,Places,Textiles Manufacture",https://penninehorizons.org/files/original/90af7ed9eda803bfb73e3cb66749cd07.jpg,"Still Image","Todmorden Antiquarian Society Photographs at the Library",1,0
27170,https://penninehorizons.org/items/show/27170,"Ferney Lee Road, Todmorden, pre 1930 - TAL00211","Ferney Lee Road, Todmorden","The cottages on the right have since been demolished. Stile House can be seen in the background. Lower Ibbotroyd Farm was demolished in 1930s to make way for Stile School, an open air School for TB sufferers. Ferney Lee Road was widened prior to the building of the Grammar School. AN 7008351X",,"Todmorden Antiquarian Society","Pennine Horizons Digital Archive",1920,,"PHDA - Todmorden Antiquarian Society","Pennine Horizons Digital Archive","TIFF file 8-bit","English (U.K.)","Documentary photograph",TAL00211.tif,,,,,,,,,,,,,,,,,,,,,,,,,,,,,,,,,,,,"Ferney Lee Road,Todmorden",https://penninehorizons.org/files/original/dd67e1c705c07fafda38dfbe07ddf690.jpg,"Still Image","Todmorden Antiquarian Society Photographs at the Library",1,0
