﻿"Item Id","Item URI","Dublin Core:Title","Dublin Core:Subject","Dublin Core:Description","Dublin Core:Creator","Dublin Core:Source","Dublin Core:Publisher","Dublin Core:Date","Dublin Core:Contributor","Dublin Core:Rights","Dublin Core:Relation","Dublin Core:Format","Dublin Core:Language","Dublin Core:Type","Dublin Core:Identifier","Dublin Core:Coverage","Item Type Metadata:Lesson Plan Text","Item Type Metadata:Bibliography","Item Type Metadata:Biographical Text","Item Type Metadata:Occupation","Item Type Metadata:Death Date","Item Type Metadata:Birthplace","Item Type Metadata:Birth Date","Item Type Metadata:Participants","Item Type Metadata:Event Type","Item Type Metadata:URL","Item Type Metadata:Bit Rate/Frequency","Item Type Metadata:Interviewer","Item Type Metadata:Interviewee","Item Type Metadata:Location","Item Type Metadata:Transcription","Item Type Metadata:Local URL","Item Type Metadata:Original Format","Item Type Metadata:Physical Dimensions","Item Type Metadata:Duration","Item Type Metadata:Compression","Item Type Metadata:Producer","Item Type Metadata:Director","Item Type Metadata:Text","Item Type Metadata:Time Summary","Item Type Metadata:Email Body","Item Type Metadata:Subject Line","Item Type Metadata:From","Item Type Metadata:To","Item Type Metadata:CC","Item Type Metadata:BCC","Item Type Metadata:Number of Attachments","Item Type Metadata:Standards","Item Type Metadata:Objectives","Item Type Metadata:Materials",tags,file,itemType,collection,public,featured
40930,https://penninehorizons.org/items/show/40930," - RAC1960.128.4","Vernacular Architecture",,"Ralph Cross",,"Pennine Horizons Digital Archive",,,"PHDA - -Ralph Cross Collection","Pennine Horizons Digital Archive","TIFF file 8-bit","English (U.K.)","Documentary photograph",RAC1960.128.4.jpg,,,,,,,,,,,,,,,,,,,,,,,,,,,,,,,,,,,,,https://penninehorizons.org/files/original/85e2851d0a7d02930938a5e966ff83f5.jpg,"Still Image","Ralph Cross 1960",1,0
40950,https://penninehorizons.org/items/show/40950," - RAC1960.130","Vernacular Architecture",,"Ralph Cross",,"Pennine Horizons Digital Archive",,,"PHDA - -Ralph Cross Collection","Pennine Horizons Digital Archive","TIFF file 8-bit","English (U.K.)","Documentary photograph",RAC1960.130.jpg,,,,,,,,,,,,,,,,,,,,,,,,,,,,,,,,,,,,,https://penninehorizons.org/files/original/85bb1f86ee3b9829dbe4a6d9f39b118f.jpg,"Still Image","Ralph Cross 1960",1,0
40945,https://penninehorizons.org/items/show/40945," - RAC1960.130.4","Vernacular Architecture",,"Ralph Cross",,"Pennine Horizons Digital Archive",,,"PHDA - -Ralph Cross Collection","Pennine Horizons Digital Archive","TIFF file 8-bit","English (U.K.)","Documentary photograph",RAC1960.130.4.jpg,,,,,,,,,,,,,,,,,,,,,,,,,,,,,,,,,,,,,https://penninehorizons.org/files/original/aa593493e977b9883ca61e235457d9eb.jpg,"Still Image","Ralph Cross 1960",1,0
40987,https://penninehorizons.org/items/show/40987," - RAC1960.156.2","Vernacular Architecture",,"Ralph Cross",,"Pennine Horizons Digital Archive",,,"PHDA - -Ralph Cross Collection","Pennine Horizons Digital Archive","TIFF file 8-bit","English (U.K.)","Documentary photograph",RAC1960.156.2.jpg,,,,,,,,,,,,,,,,,,,,,,,,,,,,,,,,,,,,,https://penninehorizons.org/files/original/74bd57a77e7dd3b12924ce53fded031a.jpg,"Still Image","Ralph Cross 1960",1,0
40964,https://penninehorizons.org/items/show/40964," Marl Pits, Newchurch Road, Rawtenstall- RAC1960.137.1","Vernacular Architecture",,"Ralph Cross",,"Pennine Horizons Digital Archive",,,"PHDA - -Ralph Cross Collection","Pennine Horizons Digital Archive","TIFF file 8-bit","English (U.K.)","Documentary photograph",RAC1960.137.1.jpg,,,,,,,,,,,,,,,,,,,,,,,,,,,,,,,,,,,,,https://penninehorizons.org/files/original/55b34495aeb8d0ad8c067d5b0e82ac51.jpg,"Still Image","Ralph Cross 1960",1,0
40942,https://penninehorizons.org/items/show/40942,"22 Lower Lane, Gomersal - RAC1960.130.1","Vernacular Architecture",,"Ralph Cross",,"Pennine Horizons Digital Archive",,,"PHDA - -Ralph Cross Collection","Pennine Horizons Digital Archive","TIFF file 8-bit","English (U.K.)","Documentary photograph",RAC1960.130.1.jpg,,,,,,,,,,,,,,,,,,,,,,,,,,,,,,,,,,,,,https://penninehorizons.org/files/original/5068137618dac964b6a02a055163e949.jpg,"Still Image","Ralph Cross 1960",1,0
40943,https://penninehorizons.org/items/show/40943,"22 Lower Lane, Gomersal - RAC1960.130.2","Vernacular Architecture",,"Ralph Cross",,"Pennine Horizons Digital Archive",,,"PHDA - -Ralph Cross Collection","Pennine Horizons Digital Archive","TIFF file 8-bit","English (U.K.)","Documentary photograph",RAC1960.130.2.jpg,,,,,,,,,,,,,,,,,,,,,,,,,,,,,,,,,,,,,https://penninehorizons.org/files/original/c12d322d8ba7c348b86f528f632417fc.jpg,"Still Image","Ralph Cross 1960",1,0
40944,https://penninehorizons.org/items/show/40944,"22 Lower Lane, Gomersal - RAC1960.130.3","Vernacular Architecture",,"Ralph Cross",,"Pennine Horizons Digital Archive",,,"PHDA - -Ralph Cross Collection","Pennine Horizons Digital Archive","TIFF file 8-bit","English (U.K.)","Documentary photograph",RAC1960.130.3.jpg,,,,,,,,,,,,,,,,,,,,,,,,,,,,,,,,,,,,,https://penninehorizons.org/files/original/5821f2a919fd9cc7d07dd10317259da9.jpg,"Still Image","Ralph Cross 1960",1,0
40946,https://penninehorizons.org/items/show/40946,"22 Lower Lane, Gomersal - RAC1960.130.6","Vernacular Architecture",,"Ralph Cross",,"Pennine Horizons Digital Archive",,,"PHDA - -Ralph Cross Collection","Pennine Horizons Digital Archive","TIFF file 8-bit","English (U.K.)","Documentary photograph",RAC1960.130.6.jpg,,,,,,,,,,,,,,,,,,,,,,,,,,,,,,,,,,,,,https://penninehorizons.org/files/original/b39f645e76ea9dc86249a77096d82cd2.jpg,"Still Image","Ralph Cross 1960",1,0
40947,https://penninehorizons.org/items/show/40947,"22 Lower Lane, Gomersal - RAC1960.130.7","Vernacular Architecture",,"Ralph Cross",,"Pennine Horizons Digital Archive",,,"PHDA - -Ralph Cross Collection","Pennine Horizons Digital Archive","TIFF file 8-bit","English (U.K.)","Documentary photograph",RAC1960.130.7.jpg,,,,,,,,,,,,,,,,,,,,,,,,,,,,,,,,,,,,,https://penninehorizons.org/files/original/0119a8caee980076cf176a9e76b5a4bf.jpg,"Still Image","Ralph Cross 1960",1,0
40948,https://penninehorizons.org/items/show/40948,"22 Lower Lane, Gomersal - RAC1960.130.8","Vernacular Architecture",,"Ralph Cross",,"Pennine Horizons Digital Archive",,,"PHDA - -Ralph Cross Collection","Pennine Horizons Digital Archive","TIFF file 8-bit","English (U.K.)","Documentary photograph",RAC1960.130.8.jpg,,,,,,,,,,,,,,,,,,,,,,,,,,,,,,,,,,,,,https://penninehorizons.org/files/original/04efe8bf42d2bbd312dee21cab8ae2c2.jpg,"Still Image","Ralph Cross 1960",1,0
40949,https://penninehorizons.org/items/show/40949,"22 Lower Lane, Gomersal - RAC1960.130.9","Vernacular Architecture",,"Ralph Cross",,"Pennine Horizons Digital Archive",,,"PHDA - -Ralph Cross Collection","Pennine Horizons Digital Archive","TIFF file 8-bit","English (U.K.)","Documentary photograph",RAC1960.130.9.jpg,,,,,,,,,,,,,,,,,,,,,,,,,,,,,,,,,,,,,https://penninehorizons.org/files/original/f852a43baa359ee1cab90f28df24dbbb.jpg,"Still Image","Ralph Cross 1960",1,0
40698,https://penninehorizons.org/items/show/40698,"47-51 Towngate, Sowerby - RAC1960.012.1","Hall_and_cross_wing, Vernacular_architecture, timber_frame^^Vernacular Architecture",,"Ralph Cross",,"Pennine Horizons Digital Archive",1960,,"PHDA - -Ralph Cross Collection","Pennine Horizons Digital Archive","TIFF file 8-bit","English (U.K.)","Documentary photograph",RAC1960.012.1.jpg,,,,,,,,,,,,,,,,,,,,,,,,,,,,,,,,,,,,"Hall_and_cross_wing,timber_frame,Vernacular_architecture",https://penninehorizons.org/files/original/5bf37298ec29ed7216a848c9dd24770f.jpg,"Still Image","Ralph Cross 1960",1,0
40699,https://penninehorizons.org/items/show/40699,"47-51 Towngate, Sowerby - RAC1960.012.2","King_Post, Vernacular_architecture, brace, tie_beam, timber_frame^^Vernacular Architecture",,"Ralph Cross",,"Pennine Horizons Digital Archive",1960,,"PHDA - -Ralph Cross Collection","Pennine Horizons Digital Archive","TIFF file 8-bit","English (U.K.)","Documentary photograph",RAC1960.012.2.jpg,,,,,,,,,,,,,,,,,,,,,,,,,,,,,,,,,,,,"Brace,King_Post,tie_beam,timber_frame,Vernacular_architecture",https://penninehorizons.org/files/original/ee09d3887f9b3d9a41152f66ebd3dbb6.jpg,"Still Image","Ralph Cross 1960",1,0
40700,https://penninehorizons.org/items/show/40700,"47-51 Towngate, Sowerby - RAC1960.012.3","King_Post, Vernacular_architecture, chamfer, tie_beam, timber_frame^^Vernacular Architecture",,"Ralph Cross",,"Pennine Horizons Digital Archive",1960,,"PHDA - -Ralph Cross Collection","Pennine Horizons Digital Archive","TIFF file 8-bit","English (U.K.)","Documentary photograph",RAC1960.012.3.jpg,,,,,,,,,,,,,,,,,,,,,,,,,,,,,,,,,,,,"chamfer,King_Post,tie_beam,timber_frame,Vernacular_architecture",https://penninehorizons.org/files/original/b410045d0f553ffd7f4d6b56e05115dd.jpg,"Still Image","Ralph Cross 1960",1,0
40701,https://penninehorizons.org/items/show/40701,"47-51 Towngate, Sowerby - RAC1960.012.4","Vernacular_architecture, post, timber_frame^^Vernacular Architecture",,"Ralph Cross",,"Pennine Horizons Digital Archive",1960,,"PHDA - -Ralph Cross Collection","Pennine Horizons Digital Archive","TIFF file 8-bit","English (U.K.)","Documentary photograph",RAC1960.012.4.jpg,,,,,,,,,,,,,,,,,,,,,,,,,,,,,,,,,,,,"Post,timber_frame,Vernacular_architecture",https://penninehorizons.org/files/original/965a93923950ddbed5b3bd7c162c45fd.jpg,"Still Image","Ralph Cross 1960",1,0
40702,https://penninehorizons.org/items/show/40702,"47-51 Towngate, Sowerby - RAC1960.012.5","Stud, Vernacular_architecture, brace, post, timber_frame^^Vernacular Architecture",,"Ralph Cross",,"Pennine Horizons Digital Archive",1960,,"PHDA - -Ralph Cross Collection","Pennine Horizons Digital Archive","TIFF file 8-bit","English (U.K.)","Documentary photograph",RAC1960.012.5.jpg,,,,,,,,,,,,,,,,,,,,,,,,,,,,,,,,,,,,"Brace,Post,stud,timber_frame,Vernacular_architecture",https://penninehorizons.org/files/original/4511b1d74f7bf9952f25bdf45552e62d.jpg,"Still Image","Ralph Cross 1960",1,0
40703,https://penninehorizons.org/items/show/40703,"47-51 Towngate, Sowerby - RAC1960.012.7 - RAC1960.012.7","King_Post, Vernacular_architecture, chamfer, tie_beam, timber_frame^^Vernacular Architecture",,"Ralph Cross",,"Pennine Horizons Digital Archive",1960,,"PHDA - -Ralph Cross Collection","Pennine Horizons Digital Archive","TIFF file 8-bit","English (U.K.)","Documentary photograph",RAC1960.012.7.jpg,,,,,,,,,,,,,,,,,,,,,,,,,,,,,,,,,,,,"chamfer,King_Post,tie_beam,timber_frame,Vernacular_architecture",https://penninehorizons.org/files/original/9d5f750798d684846c960a9f18c21c71.jpg,"Still Image","Ralph Cross 1960",1,0
40704,https://penninehorizons.org/items/show/40704,"47-51 Towngate, Sowerby - RAC1960.012.8","Vernacular_architecture, brace, post, tie_beam, timber_frame^^Vernacular Architecture",,"Ralph Cross",,"Pennine Horizons Digital Archive",1960,,"PHDA - -Ralph Cross Collection","Pennine Horizons Digital Archive","TIFF file 8-bit","English (U.K.)","Documentary photograph",RAC1960.012.8.jpg,,,,,,,,,,,,,,,,,,,,,,,,,,,,,,,,,,,,"Brace,Post,tie_beam,timber_frame,Vernacular_architecture",https://penninehorizons.org/files/original/d46b38eb075c93d57e39d03086cd6c43.jpg,"Still Image","Ralph Cross 1960",1,0
40705,https://penninehorizons.org/items/show/40705,"47-51 Towngate, Sowerby - RAC1960.012.9","Vernacular_architecture, brace, post, tie_beam, timber_frame^^Vernacular Architecture",,"Ralph Cross",,"Pennine Horizons Digital Archive",1960,,"PHDA - -Ralph Cross Collection","Pennine Horizons Digital Archive","TIFF file 8-bit","English (U.K.)","Documentary photograph",RAC1960.012.9.jpg,,,,,,,,,,,,,,,,,,,,,,,,,,,,,,,,,,,,"Brace,Post,tie_beam,timber_frame,Vernacular_architecture",https://penninehorizons.org/files/original/5ac4a28f4306d6e7eb3493f82d2c48f4.jpg,"Still Image","Ralph Cross 1960",1,0
40734,https://penninehorizons.org/items/show/40734,"Anderton Fold, Northowram - RAC1960.028","Vernacular Architecture",,"Ralph Cross",,"Pennine Horizons Digital Archive",1960,,"PHDA - -Ralph Cross Collection","Pennine Horizons Digital Archive","TIFF file 8-bit","English (U.K.)","Documentary photograph",RAC1960.028.jpg,,,,,,,,,,,,,,,,,,,,,,,,,,,,,,,,,,,,,https://penninehorizons.org/files/original/1b957657effa26d61754d256ef70b80f.jpg,"Still Image","Ralph Cross 1960",1,0
40674,https://penninehorizons.org/items/show/40674,"Arms of Oliver Cromwell - RAC1960.001","Vernacular Architecture","From print, London Museum","Ralph Cross",,"Pennine Horizons Digital Archive",1960,,"PHDA - -Ralph Cross Collection","Pennine Horizons Digital Archive","TIFF file 8-bit","English (U.K.)","Documentary photograph",RAC1960.001.jpg,,,,,,,,,,,,,,,,,,,,,,,,,,,,,,,,,,,,,https://penninehorizons.org/files/original/45023b047086affe93c7b100456e7ade.jpg,"Still Image","Ralph Cross 1960",1,0
40744,https://penninehorizons.org/items/show/40744,"Arrowsmith House, Brindle - RAC1960.038","Iron_roof, Mullion, Vernacular_architecture, porch^^Vernacular Architecture",,"Ralph Cross",,"Pennine Horizons Digital Archive",1960,,"PHDA - -Ralph Cross Collection","Pennine Horizons Digital Archive","TIFF file 8-bit","English (U.K.)","Documentary photograph",RAC1960.038.jpg,,,,,,,,,,,,,,,,,,,,,,,,,,,,,,,,,,,,"Iron_roof,Mullion,Porch,Vernacular_architecture",https://penninehorizons.org/files/original/76106a8adbd29f343dab89a6b054641f.jpg,"Still Image","Ralph Cross 1960",1,0
40956,https://penninehorizons.org/items/show/40956,"Barn at Grayrigg, Cumbria - RAC1960.134.1","Vernacular Architecture",,"Ralph Cross",,"Pennine Horizons Digital Archive",,,"PHDA - -Ralph Cross Collection","Pennine Horizons Digital Archive","TIFF file 8-bit","English (U.K.)","Documentary photograph",RAC1960.134.1.jpg,,,,,,,,,,,,,,,,,,,,,,,,,,,,,,,,,,,,,https://penninehorizons.org/files/original/a15d9b9737dca79922970d7e5ae6a5c9.jpg,"Still Image","Ralph Cross 1960",1,0
40957,https://penninehorizons.org/items/show/40957,"Barn at Grayrigg, Cumbria - RAC1960.134.2","Vernacular Architecture",,"Ralph Cross",,"Pennine Horizons Digital Archive",,,"PHDA - -Ralph Cross Collection","Pennine Horizons Digital Archive","TIFF file 8-bit","English (U.K.)","Documentary photograph",RAC1960.134.2.jpg,,,,,,,,,,,,,,,,,,,,,,,,,,,,,,,,,,,,,https://penninehorizons.org/files/original/88fc9279a21fb25cc6ece7c43eb31c0e.jpg,"Still Image","Ralph Cross 1960",1,0
