﻿"Item Id","Item URI","Dublin Core:Title","Dublin Core:Subject","Dublin Core:Description","Dublin Core:Creator","Dublin Core:Source","Dublin Core:Publisher","Dublin Core:Date","Dublin Core:Contributor","Dublin Core:Rights","Dublin Core:Relation","Dublin Core:Format","Dublin Core:Language","Dublin Core:Type","Dublin Core:Identifier","Dublin Core:Coverage","Item Type Metadata:Lesson Plan Text","Item Type Metadata:Bibliography","Item Type Metadata:Biographical Text","Item Type Metadata:Occupation","Item Type Metadata:Death Date","Item Type Metadata:Birthplace","Item Type Metadata:Birth Date","Item Type Metadata:Participants","Item Type Metadata:Event Type","Item Type Metadata:URL","Item Type Metadata:Bit Rate/Frequency","Item Type Metadata:Interviewer","Item Type Metadata:Interviewee","Item Type Metadata:Location","Item Type Metadata:Transcription","Item Type Metadata:Local URL","Item Type Metadata:Original Format","Item Type Metadata:Physical Dimensions","Item Type Metadata:Duration","Item Type Metadata:Compression","Item Type Metadata:Producer","Item Type Metadata:Director","Item Type Metadata:Text","Item Type Metadata:Time Summary","Item Type Metadata:Email Body","Item Type Metadata:Subject Line","Item Type Metadata:From","Item Type Metadata:To","Item Type Metadata:CC","Item Type Metadata:BCC","Item Type Metadata:Number of Attachments","Item Type Metadata:Standards","Item Type Metadata:Objectives","Item Type Metadata:Materials",tags,file,itemType,collection,public,featured
40741,https://penninehorizons.org/items/show/40741,"Mercer Field, Shore - RAC1960.035","Field_barn, Vernacular_architecture^^Vernacular Architecture",,"Ralph Cross",,"Pennine Horizons Digital Archive",1960,,"PHDA - -Ralph Cross Collection","Pennine Horizons Digital Archive","TIFF file 8-bit","English (U.K.)","Documentary photograph",RAC1960.035.jpg,,,,,,,,,,,,,,,,,,,,,,,,,,,,,,,,,,,,"Field_barn,Vernacular_architecture",https://penninehorizons.org/files/original/5e8f82442a6b2a809675740c5f457f30.jpg,"Still Image","Ralph Cross 1960",1,0
40965,https://penninehorizons.org/items/show/40965,"Marl Pitts, Newchurch Road, Rawtenstall,  - RAC1960.137.2","Vernacular Architecture",,"Ralph Cross",,"Pennine Horizons Digital Archive",,,"PHDA - -Ralph Cross Collection","Pennine Horizons Digital Archive","TIFF file 8-bit","English (U.K.)","Documentary photograph",RAC1960.137.2.jpg,,,,,,,,,,,,,,,,,,,,,,,,,,,,,,,,,,,,,https://penninehorizons.org/files/original/b8bc2440f1bea25a405524429d84a870.jpg,"Still Image","Ralph Cross 1960",1,0
40753,https://penninehorizons.org/items/show/40753,"Malham - RAC1960.040.7","Landsccape, Waterfall^^Vernacular Architecture",,"Ralph Cross",,"Pennine Horizons Digital Archive",1960,,"PHDA - -Ralph Cross Collection","Pennine Horizons Digital Archive","TIFF file 8-bit","English (U.K.)","Documentary photograph",RAC1960.040.7.jpg,,,,,,,,,,,,,,,,,,,,,,,,,,,,,,,,,,,,"Landsccape,Waterfall",https://penninehorizons.org/files/original/345d4c671d3957ba8994ad8b1e47eb41.jpg,"Still Image","Ralph Cross 1960",1,0
40752,https://penninehorizons.org/items/show/40752,"Malham - RAC1960.040.6","Landsccape^^Vernacular Architecture",,"Ralph Cross",,"Pennine Horizons Digital Archive",1960,,"PHDA - -Ralph Cross Collection","Pennine Horizons Digital Archive","TIFF file 8-bit","English (U.K.)","Documentary photograph",RAC1960.040.6.jpg,,,,,,,,,,,,,,,,,,,,,,,,,,,,,,,,,,,,Landsccape,https://penninehorizons.org/files/original/e6250b1524b94187bc07c70bb14591e8.jpg,"Still Image","Ralph Cross 1960",1,0
40751,https://penninehorizons.org/items/show/40751,"Malham - RAC1960.040.5","Landsccape^^Vernacular Architecture",,"Ralph Cross",,"Pennine Horizons Digital Archive",1960,,"PHDA - -Ralph Cross Collection","Pennine Horizons Digital Archive","TIFF file 8-bit","English (U.K.)","Documentary photograph",RAC1960.040.5.jpg,,,,,,,,,,,,,,,,,,,,,,,,,,,,,,,,,,,,Landsccape,https://penninehorizons.org/files/original/55b101926c0b9c4ca259d76fbd048853.jpg,"Still Image","Ralph Cross 1960",1,0
40750,https://penninehorizons.org/items/show/40750,"Malham - RAC1960.040.4","Inscription, Plaque^^Vernacular Architecture","The inscription reads: 

Here lyeth the body of John Lambert late of Carlton in the County of Yorke, Esq he was son and heir to Major General john Lambert, was married to Barbara ye daughter of Thomas Lister of Arnolds Bigging in the same County Esq by whom had four children viz sons deceased and one daughter Frances now liveing, and the wife of Sir John Middleton of Belsay Castle in ye County of Northumberland Bart: he died the 14th day of March in the year of our Lord 1901 being the last heir male in whom that ancient family of ye Lamberts in a line from William the Conqueror and related to him by marriage is now extinct.","Ralph Cross",,"Pennine Horizons Digital Archive",1960,,"PHDA - -Ralph Cross Collection","Pennine Horizons Digital Archive","TIFF file 8-bit","English (U.K.)","Documentary photograph",RAC1960.040.4.jpg,,,,,,,,,,,,,,,,,,,,,,,,,,,,,,,,,,,,"Inscription,Plaque",https://penninehorizons.org/files/original/7530b4daa23d0b609111633b40adaf50.jpg,"Still Image","Ralph Cross 1960",1,0
40749,https://penninehorizons.org/items/show/40749,"Malham - RAC1960.040.3","Vernacular Architecture",Malham,,,"Pennine Horizons Digital Archive",,,"PHDA - -Ralph Cross Collection","Pennine Horizons Digital Archive","TIFF file 8-bit","English (U.K.)","Documentary photograph",RAC1960.040.3.jpg,,,,,,,,,,,,,,,,,,,,,,,,,,,,,,,,,,,,,https://penninehorizons.org/files/original/8fe92247a1bee27f4992001b13a68ab8.jpg,"Still Image","Ralph Cross 1960",1,0
40748,https://penninehorizons.org/items/show/40748,"Malham - RAC1960.040.2","Workshop, fish, shepherd's_crook^^Vernacular Architecture",,"Ralph Cross",,"Pennine Horizons Digital Archive",1960,,"PHDA - -Ralph Cross Collection","Pennine Horizons Digital Archive","TIFF file 8-bit","English (U.K.)","Documentary photograph",RAC1960.040.2.jpg,,,,,,,,,,,,,,,,,,,,,,,,,,,,,,,,,,,,"Fish,shepherd's_crook,Workshop",https://penninehorizons.org/files/original/9999a795532fa97792590fe9015e00cb.jpg,"Still Image","Ralph Cross 1960",1,0
40747,https://penninehorizons.org/items/show/40747,"Malham - RAC1960.040.1","Vernacular Architecture",,"Ralph Cross",,"Pennine Horizons Digital Archive",1960,,"PHDA - -Ralph Cross Collection","Pennine Horizons Digital Archive","TIFF file 8-bit","English (U.K.)","Documentary photograph",RAC1960.040.1.jpg,,,,,,,,,,,,,,,,,,,,,,,,,,,,,,,,,,,,,https://penninehorizons.org/files/original/03aa6ff329f584e5bba800bb5fc38684.jpg,"Still Image","Ralph Cross 1960",1,0
40780,https://penninehorizons.org/items/show/40780,"Lydgate Mill, Todmorden - RAC1960.062","Vernacular Architecture",,,,"Pennine Horizons Digital Archive",,,"PHDA - -Ralph Cross Collection","Pennine Horizons Digital Archive","TIFF file 8-bit","English (U.K.)","Documentary photograph",RAC1960.062.jpg,,,,,,,,,,,,,,,,,,,,,,,,,,,,,,,,,,,,,https://penninehorizons.org/files/original/96d723b9c5871910dc92b1eee9402748.jpg,"Still Image","Ralph Cross 1960",1,0
40709,https://penninehorizons.org/items/show/40709,"Lower Nutshaw Barn, Clowbridge, near Burnley - RAC1960.015","Cobbles^^Vernacular Architecture","Showing carved head.",,,"Pennine Horizons Digital Archive",,,"PHDA - -Ralph Cross Collection","Pennine Horizons Digital Archive","TIFF file 8-bit","English (U.K.)","Documentary photograph",RAC1960.015.tif,,,,,,,,,,,,,,,,,,,,,,,,,,,,,,,,,,,,Cobbles,https://penninehorizons.org/files/original/83d905a71ee9b0ab5b8971af289ff271.jpg,"Still Image","Ralph Cross 1960",1,0
40852,https://penninehorizons.org/items/show/40852,"Lower Hartley, Todmorden - RAC1960.099 ","Barn, Coping, Kneeler, cottage^^Vernacular Architecture",,"Ralph Cross",,"Pennine Horizons Digital Archive",1960,,"PHDA - -Ralph Cross Collection","Pennine Horizons Digital Archive","TIFF file 8-bit","English (U.K.)","Documentary photograph",RAC1960.099.jpg,,,,,,,,,,,,,,,,,,,,,,,,,,,,,,,,,,,,"Barn,Coping,cottage,Kneeler",https://penninehorizons.org/files/original/75acc6b23b375b70ac4c6904b99a15a9.jpg,"Still Image","Ralph Cross 1960",1,0
40876,https://penninehorizons.org/items/show/40876,"Lower Constable Farm, Rawtenstall - RAC1960.114.3","Vernacular Architecture",,"Ralph Cross",,"Pennine Horizons Digital Archive",,,"PHDA - -Ralph Cross Collection","Pennine Horizons Digital Archive","TIFF file 8-bit","English (U.K.)","Documentary photograph",RAC1960.114.3.jpg,,,,,,,,,,,,,,,,,,,,,,,,,,,,,,,,,,,,,https://penninehorizons.org/files/original/27fbb2fde094e0addd023ba30abb6bcd.jpg,"Still Image","Ralph Cross 1960",1,0
40875,https://penninehorizons.org/items/show/40875,"Lower Constable Farm, Rawtenstall - RAC1960.114.2","Vernacular Architecture",,"Ralph Cross",,"Pennine Horizons Digital Archive",,,"PHDA - -Ralph Cross Collection","Pennine Horizons Digital Archive","TIFF file 8-bit","English (U.K.)","Documentary photograph",RAC1960.114.2.jpg,,,,,,,,,,,,,,,,,,,,,,,,,,,,,,,,,,,,,https://penninehorizons.org/files/original/c76ec29574314cefe0ff3a86e5e00717.jpg,"Still Image","Ralph Cross 1960",1,0
40874,https://penninehorizons.org/items/show/40874,"Lower Constable Farm, Rawtenstall - RAC1960.114.1","Vernacular Architecture",,"Ralph Cross",,"Pennine Horizons Digital Archive",,,"PHDA - -Ralph Cross Collection","Pennine Horizons Digital Archive","TIFF file 8-bit","English (U.K.)","Documentary photograph",RAC1960.114.1.jpg,,,,,,,,,,,,,,,,,,,,,,,,,,,,,,,,,,,,,https://penninehorizons.org/files/original/c93382a8d27ffdd9ed4a30838d852710.jpg,"Still Image","Ralph Cross 1960",1,0
40925,https://penninehorizons.org/items/show/40925,"Lower Claypits, Soyland - RAC1960.125.1","Vernacular Architecture",,"Ralph Cross",,"Pennine Horizons Digital Archive",,,"PHDA - -Ralph Cross Collection","Pennine Horizons Digital Archive","TIFF file 8-bit","English (U.K.)","Documentary photograph",RAC1960.125.1.jpg,,,,,,,,,,,,,,,,,,,,,,,,,,,,,,,,,,,,,https://penninehorizons.org/files/original/97480d261213536a4bc3ffde78f32cec.jpg,"Still Image","Ralph Cross 1960",1,0
40845,https://penninehorizons.org/items/show/40845,"Lower Chapel Hill, Rawtenstall - RAC1960.096","Barn, Farmhouse, Hoodmould, Vernacular_architecture^^Vernacular Architecture",,"Ralph Cross",,"Pennine Horizons Digital Archive",1960,,"PHDA - -Ralph Cross Collection","Pennine Horizons Digital Archive","TIFF file 8-bit","English (U.K.)","Documentary photograph",RAC1960.096.jpg,,,,,,,,,,,,,,,,,,,,,,,,,,,,,,,,,,,,"Barn,Farmhouse,Hoodmould,Vernacular_architecture",https://penninehorizons.org/files/original/a84a379ff1c949004f2be56b847b133c.jpg,"Still Image","Ralph Cross 1960",1,0
40707,https://penninehorizons.org/items/show/40707,"Low Bentley, Shelf - RAC1960.013.2","Hall_and_cross_wing, Mullion_and_transom_window, Vernacular_architecture, outbuilding^^Vernacular Architecture",,"Ralph Cross",,"Pennine Horizons Digital Archive",1960,,"PHDA - -Ralph Cross Collection","Pennine Horizons Digital Archive","TIFF file 8-bit","English (U.K.)","Documentary photograph",RAC1960.013.2.jpg,,,,,,,,,,,,,,,,,,,,,,,,,,,,,,,,,,,,"Hall_and_cross_wing,Mullion_and_transom_window,outbuilding,Vernacular_architecture",https://penninehorizons.org/files/original/9eff4580419d33f6aa3b745600398c94.jpg,"Still Image","Ralph Cross 1960",1,0
40706,https://penninehorizons.org/items/show/40706,"Low Bentley, Shelf - RAC1960.013.1","Hall_and_cross_wing, Kneeler, Mullion_and_transom_window, Vernacular_architecture, finial^^Vernacular Architecture",,"Ralph Cross",,"Pennine Horizons Digital Archive",1960,,"PHDA - -Ralph Cross Collection","Pennine Horizons Digital Archive","TIFF file 8-bit","English (U.K.)","Documentary photograph",RAC1960.013.1.jpg,,,,,,,,,,,,,,,,,,,,,,,,,,,,,,,,,,,,"Finial,Hall_and_cross_wing,Kneeler,Mullion_and_transom_window,Vernacular_architecture",https://penninehorizons.org/files/original/c76932f604f0542eccaed299534659d8.jpg,"Still Image","Ralph Cross 1960",1,0
40864,https://penninehorizons.org/items/show/40864,"Long Croft, Cowling - RAC1960.109.2","Vernacular Architecture",,"Ralph Cross",,"Pennine Horizons Digital Archive",,,"PHDA - -Ralph Cross Collection","Pennine Horizons Digital Archive","TIFF file 8-bit","English (U.K.)","Documentary photograph",RAC1960.109.2.jpg,,,,,,,,,,,,,,,,,,,,,,,,,,,,,,,,,,,,,https://penninehorizons.org/files/original/4289d29ae5193bb91e020c21efdc210a.jpg,"Still Image","Ralph Cross 1960",1,0
40863,https://penninehorizons.org/items/show/40863,"Long Croft, Cowling - RAC1960.109.1","Vernacular Architecture",,"Ralph Cross",,"Pennine Horizons Digital Archive",,,"PHDA - -Ralph Cross Collection","Pennine Horizons Digital Archive","TIFF file 8-bit","English (U.K.)","Documentary photograph",RAC1960.109.1.jpg,,,,,,,,,,,,,,,,,,,,,,,,,,,,,,,,,,,,,https://penninehorizons.org/files/original/229528a37cbc8f6fcec38fa0ea7ae652.jpg,"Still Image","Ralph Cross 1960",1,0
40735,https://penninehorizons.org/items/show/40735,"Little Cote Barn, Thackley - RAC1960.029","Barn, King_post_roof, Vernacular_architecture, rafters, re-used_timber^^Vernacular Architecture",,"Ralph Cross",,"Pennine Horizons Digital Archive",1960,,"PHDA - -Ralph Cross Collection","Pennine Horizons Digital Archive","TIFF file 8-bit","English (U.K.)","Documentary photograph",RAC1960.029.jpg,,,,,,,,,,,,,,,,,,,,,,,,,,,,,,,,,,,,"Barn,King_post_roof,rafters,re-used_timber,Vernacular_architecture",https://penninehorizons.org/files/original/092a19195eb08d1d68e460a3305f6375.jpg,"Still Image","Ralph Cross 1960",1,0
40797,https://penninehorizons.org/items/show/40797,"Little Burlees, Wadsworth - RAC1960.072.3 ","Vernacular Architecture",,,,"Pennine Horizons Digital Archive",,,"PHDA - -Ralph Cross Collection","Pennine Horizons Digital Archive","TIFF file 8-bit","English (U.K.)","Documentary photograph",RAC1960.072.3.jpg,,,,,,,,,,,,,,,,,,,,,,,,,,,,,,,,,,,,,https://penninehorizons.org/files/original/3e9c0216da6806a00251b0c1960ff3b4.jpg,"Still Image","Ralph Cross 1960",1,0
40796,https://penninehorizons.org/items/show/40796,"Little Burlees, Wadsworth - RAC1960.072.2 ","Vernacular Architecture",,,,"Pennine Horizons Digital Archive",,,"PHDA - -Ralph Cross Collection","Pennine Horizons Digital Archive","TIFF file 8-bit","English (U.K.)","Documentary photograph",RAC1960.072.2.jpg,,,,,,,,,,,,,,,,,,,,,,,,,,,,,,,,,,,,,https://penninehorizons.org/files/original/ab20db66c53671af8534b29d1bc30b3a.jpg,"Still Image","Ralph Cross 1960",1,0
40795,https://penninehorizons.org/items/show/40795,"Little Burlees, Wadsworth - RAC1960.072.1 ","Vernacular Architecture",,,,"Pennine Horizons Digital Archive",,,"PHDA - -Ralph Cross Collection","Pennine Horizons Digital Archive","TIFF file 8-bit","English (U.K.)","Documentary photograph",RAC1960.072.1.jpg,,,,,,,,,,,,,,,,,,,,,,,,,,,,,,,,,,,,,https://penninehorizons.org/files/original/453862ab57c5071776da737da6af4d7d.jpg,"Still Image","Ralph Cross 1960",1,0
