﻿"Item Id","Item URI","Dublin Core:Title","Dublin Core:Subject","Dublin Core:Description","Dublin Core:Creator","Dublin Core:Source","Dublin Core:Publisher","Dublin Core:Date","Dublin Core:Contributor","Dublin Core:Rights","Dublin Core:Relation","Dublin Core:Format","Dublin Core:Language","Dublin Core:Type","Dublin Core:Identifier","Dublin Core:Coverage","Item Type Metadata:Lesson Plan Text","Item Type Metadata:Bibliography","Item Type Metadata:Biographical Text","Item Type Metadata:Occupation","Item Type Metadata:Death Date","Item Type Metadata:Birthplace","Item Type Metadata:Birth Date","Item Type Metadata:Participants","Item Type Metadata:Event Type","Item Type Metadata:URL","Item Type Metadata:Bit Rate/Frequency","Item Type Metadata:Interviewer","Item Type Metadata:Interviewee","Item Type Metadata:Location","Item Type Metadata:Transcription","Item Type Metadata:Local URL","Item Type Metadata:Original Format","Item Type Metadata:Physical Dimensions","Item Type Metadata:Duration","Item Type Metadata:Compression","Item Type Metadata:Producer","Item Type Metadata:Director","Item Type Metadata:Text","Item Type Metadata:Time Summary","Item Type Metadata:Email Body","Item Type Metadata:Subject Line","Item Type Metadata:From","Item Type Metadata:To","Item Type Metadata:CC","Item Type Metadata:BCC","Item Type Metadata:Number of Attachments","Item Type Metadata:Standards","Item Type Metadata:Objectives","Item Type Metadata:Materials",tags,file,itemType,collection,public,featured
22939,https://penninehorizons.org/items/show/22939,"Pennine Farm - DEF00119","Agricultural buildings, Agriculture, Agriculture, Derelict building, Farm, Moorland, stone walls","Location not known.",,"Pennine Horizons Digital Archive","Pennine Horizons Digital Archive","No date yet","David Fletcher","PHDA - David Fletcher Collection","Pennine Horizons Digital Archive","TIFF file 8-bit","English (U.K.)","Documentary photograph",DEF00119.tif,"Hebden Bridge",,,,,,,,,,,,,,,,,,,,,,,,,,,,,,,,,,,"Agriculture,Derelict building,Farm,Moorland,stone walls",https://penninehorizons.org/files/original/6086fba41c1f260eb4bca4438c9e2b2e.jpg,"Still Image","David Fletcher collection",1,0
26411,https://penninehorizons.org/items/show/26411,"Picture House poster for week commencing 1 December 1924","Building, Cinema, Hebden Bridge, Picture House, Picture house, Poster","Two films on this week, Daring Youth, and Thy Name is Woman.",Unknown,"David Fletcher","Pennine Horizons Digital Archive",1924,,"PHDA - David Fletcher Collection","Pennine Horizons Digital Archive","TIFF file 8-bit","English (U.K.)","Documentary poster",DFP00112.tif,,,,,,,,,,,,,,,,,,,,,,,,,,,,,,,,,,,,"Building,Cinema,Hebden Bridge,Picture House,Poster",https://penninehorizons.org/files/original/8a1a748469f6c74a4bd5e4737e3c1150.jpg,"Still Image","David Fletcher collection",1,0
26405,https://penninehorizons.org/items/show/26405,"Picture House poster for week commencing 14 June 1926","Building, Cinema, Hebden Bridge, Picture House, Picture house, Poster","Two films on this week, The Iron Horse and Man & Maid.",Unknown,"David Fletcher","Pennine Horizons Digital Archive",1926,,"PHDA - David Fletcher Collection","Pennine Horizons Digital Archive","TIFF file 8-bit","English (U.K.)","Documentary poster",DFP00106.tif,,,,,,,,,,,,,,,,,,,,,,,,,,,,,,,,,,,,"Building,Cinema,Hebden Bridge,Picture House,Poster",https://penninehorizons.org/files/original/5f45c439ccb5730dd1fd80e62eea1847.jpg,"Still Image","David Fletcher collection",1,0
26400,https://penninehorizons.org/items/show/26400,"Picture House poster for week commencing 15 December 1924","Building, Cinema, Hebden Bridge, Picture House, Picture house, Poster","Two films on this week, Flaming Youth with Colleen Moore, and Jackie Coogan in Long Live The King",Unknown,"David Fletcher","Pennine Horizons Digital Archive",1924,,"PHDA - David Fletcher Collection","Pennine Horizons Digital Archive","TIFF file 8-bit","English (U.K.)","Documentary poster",DFP00101.tif,,,,,,,,,,,,,,,,,,,,,,,,,,,,,,,,,,,,"Building,Cinema,Hebden Bridge,Picture House,Poster",https://penninehorizons.org/files/original/936059ac7e2aedeae1a7eafe377c589a.jpg,"Still Image","David Fletcher collection",1,0
26407,https://penninehorizons.org/items/show/26407,"Picture House poster for week commencing 15 March 1926","Building, Cinema, Hebden Bridge, Picture House, Picture house, Poster","Two films on this week, The Lost World and Easy Money.",Unknown,"David Fletcher","Pennine Horizons Digital Archive",1926,,"PHDA - David Fletcher Collection","Pennine Horizons Digital Archive","TIFF file 8-bit","English (U.K.)","Documentary poster",DFP00108.tif,,,,,,,,,,,,,,,,,,,,,,,,,,,,,,,,,,,,"Building,Cinema,Hebden Bridge,Picture House,Poster",https://penninehorizons.org/files/original/fd1e610c5aa506285acab36121831c8e.jpg,"Still Image","David Fletcher collection",1,0
26403,https://penninehorizons.org/items/show/26403,"Picture House poster for week commencing 16 August 1926","Building, Cinema, Hebden Bridge, Picture House, Picture house, Poster","Three films on this week, Is Love Everything?, The Great Love and The Lady Who Lied.",Unknown,"David Fletcher","Pennine Horizons Digital Archive",1926,,"PHDA - David Fletcher Collection","Pennine Horizons Digital Archive","TIFF file 8-bit","English (U.K.)","Documentary poster",DFP00104.tif,,,,,,,,,,,,,,,,,,,,,,,,,,,,,,,,,,,,"Building,Cinema,Hebden Bridge,Picture House,Poster",https://penninehorizons.org/files/original/6994c021295f599ed739ef7fe858c091.jpg,"Still Image","David Fletcher collection",1,0
26402,https://penninehorizons.org/items/show/26402,"Picture House poster for week commencing 19 July 1926","Building, Cinema, Hebden Bridge, Picture House, Picture house, Poster","Three films on this week, Headlines, The Adventures of Maisie and The Pleasure Buyers.",Unknown,"David Fletcher","Pennine Horizons Digital Archive",1926,,"PHDA - David Fletcher Collection","Pennine Horizons Digital Archive","TIFF file 8-bit","English (U.K.)","Documentary poster",DFP00103.tif,,,,,,,,,,,,,,,,,,,,,,,,,,,,,,,,,,,,"Building,Cinema,Hebden Bridge,Picture House,Poster",https://penninehorizons.org/files/original/443ba7c58c33e878982bc5661f38e805.jpg,"Still Image","David Fletcher collection",1,0
26413,https://penninehorizons.org/items/show/26413,"Picture House poster for week commencing 19 November 1923","Building, Cinema, Hebden Bridge, Picture House, Picture house, Poster","Four films on this week, Charlie Chaplin in The Pilgrim, an all start cast in The Old Oaken Bucket, Alma Rubens in Find the Woman, and Douglas Maclean in Bell Boy 13.",Unknown,"David Fletcher","Pennine Horizons Digital Archive",1923,,"PHDA - David Fletcher Collection","Pennine Horizons Digital Archive","TIFF file 8-bit","English (U.K.)","Documentary poster",DFP00114.tif,,,,,,,,,,,,,,,,,,,,,,,,,,,,,,,,,,,,"Building,Cinema,Hebden Bridge,Picture House,Poster",https://penninehorizons.org/files/original/713ece23f640b7c5d2d53da6aa5cb54c.jpg,"Still Image","David Fletcher collection",1,0
26412,https://penninehorizons.org/items/show/26412,"Picture House poster for week commencing 20 December 1926","Building, Cinema, Hebden Bridge, Picture House, Picture house, Poster","Four films on this week, Betty Balfour in The Sea Urchin, The Verdict, Rudolph Valentino in The Eagle, and a star cast in Brothers.",Unknown,"David Fletcher","Pennine Horizons Digital Archive",1926,,"PHDA - David Fletcher Collection","Pennine Horizons Digital Archive","TIFF file 8-bit","English (U.K.)","Documentary poster",DFP00113.tif,,,,,,,,,,,,,,,,,,,,,,,,,,,,,,,,,,,,"Building,Cinema,Hebden Bridge,Picture House,Poster",https://penninehorizons.org/files/original/38ebb3681cf25ce594ad91b2d332ea14.jpg,"Still Image","David Fletcher collection",1,0
26404,https://penninehorizons.org/items/show/26404,"Picture House poster for week commencing 21 April 1924","Building, Cinema, Hebden Bridge, Picture House, Picture house, Poster","Two films on this week, Betty Compson in Woman to Woman and The Acquittal with Norman Kerry and Claire Windsor.",Unknown,"David Fletcher","Pennine Horizons Digital Archive",1924,,"PHDA - David Fletcher Collection","Pennine Horizons Digital Archive","TIFF file 8-bit","English (U.K.)","Documentary poster",DFP00105.tif,,,,,,,,,,,,,,,,,,,,,,,,,,,,,,,,,,,,"Building,Cinema,Hebden Bridge,Picture House,Poster",https://penninehorizons.org/files/original/beda2d2f49837692e7172d6fa8ab8fdd.jpg,"Still Image","David Fletcher collection",1,0
26401,https://penninehorizons.org/items/show/26401,"Picture House poster for week commencing 22 June 1925","Building, Cinema, Hebden Bridge, Picture House, Picture house, Poster","Two films on this week, Tess of the D'Urbervilles and Helen's Babies.",Unknown,"David Fletcher","Pennine Horizons Digital Archive",1925,,"PHDA - David Fletcher Collection","Pennine Horizons Digital Archive","TIFF file 8-bit","English (U.K.)","Documentary poster",DFP00102.tif,,,,,,,,,,,,,,,,,,,,,,,,,,,,,,,,,,,,"Building,Cinema,Hebden Bridge,Picture House,Poster",https://penninehorizons.org/files/original/6a07e971dc7a63cd1d96e872635a59a8.jpg,"Still Image","David Fletcher collection",1,0
26408,https://penninehorizons.org/items/show/26408,"Picture House poster for week commencing 22 October 1923","Building, Cinema, Hebden Bridge, Picture House, Picture house, Poster","Two films on this week, Blood and Sand with Rudolph Valentino and Love! with Louise Glaum and James Kirkwood.",Unknown,"David Fletcher","Pennine Horizons Digital Archive",1926,,"PHDA - David Fletcher Collection","Pennine Horizons Digital Archive","TIFF file 8-bit","English (U.K.)","Documentary poster",DFP00109.tif,,,,,,,,,,,,,,,,,,,,,,,,,,,,,,,,,,,,"Building,Cinema,Hebden Bridge,Picture House,Poster",https://penninehorizons.org/files/original/761920729e81f1ccacc681982853f62b.jpg,"Still Image","David Fletcher collection",1,0
26410,https://penninehorizons.org/items/show/26410,"Picture House poster for week commencing 28 August 1922","Building, Cinema, Hebden Bridge, Picture House, Picture house, Poster","Two films on this week, Pearl White in Know Your Men, and George K. Arthur and The Wheels of Chance.",Unknown,"David Fletcher","Pennine Horizons Digital Archive",1922,,"PHDA - David Fletcher Collection","Pennine Horizons Digital Archive","TIFF file 8-bit","English (U.K.)","Documentary poster",DFP00111.tif,,,,,,,,,,,,,,,,,,,,,,,,,,,,,,,,,,,,"Building,Cinema,Hebden Bridge,Picture House,Poster",https://penninehorizons.org/files/original/883c731b7b087793f55cfe77272b1224.jpg,"Still Image","David Fletcher collection",1,0
26406,https://penninehorizons.org/items/show/26406,"Picture House poster for week commencing 4 May 1925","Building, Cinema, Hebden Bridge, Picture House, Picture house, Poster","Two films on this week, Lon Chaney in The Hunchback of Notre Dame, and The Passionate Adventure.",Unknown,"David Fletcher","Pennine Horizons Digital Archive",1925,,"PHDA - David Fletcher Collection","Pennine Horizons Digital Archive","TIFF file 8-bit","English (U.K.)","Documentary poster",DFP00107.tif,,,,,,,,,,,,,,,,,,,,,,,,,,,,,,,,,,,,"Building,Cinema,Hebden Bridge,Picture House,Poster",https://penninehorizons.org/files/original/31e91f0645f3fa33b95d0bfc4b6a325b.jpg,"Still Image","David Fletcher collection",1,0
26409,https://penninehorizons.org/items/show/26409,"Picture House poster for week commencing 5 July 1926","Building, Cinema, Hebden Bridge, Picture House, Picture house, Poster","Three films on this week, Pretty Ladies with Tom Moore, Go West with Buster Keaton, and Rose of the World.",Unknown,"David Fletcher","Pennine Horizons Digital Archive",1926,,"PHDA - David Fletcher Collection","Pennine Horizons Digital Archive","TIFF file 8-bit","English (U.K.)","Documentary poster",DFP00110.tif,,,,,,,,,,,,,,,,,,,,,,,,,,,,,,,,,,,,"Building,Cinema,Hebden Bridge,Picture House,Poster",https://penninehorizons.org/files/original/010412598694be4690ca255b99962e23.jpg,"Still Image","David Fletcher collection",1,0
23009,https://penninehorizons.org/items/show/23009,"Possibly Mytholmroyd - DEF00190",Industry,"Location unknown",,"Pennine Horizons Digital Archive","Pennine Horizons Digital Archive","No date yet","David Fletcher","PHDA - David Fletcher Collection","Pennine Horizons Digital Archive","TIFF file 8-bit","English (U.K.)","Documentary photograph",DEF00190.tif,"Hebden Bridge",,,,,,,,,,,,,,,,,,,,,,,,,,,,,,,,,,,Industry,https://penninehorizons.org/files/original/9429e14112356b807e616f748d19109f.jpg,"Still Image","David Fletcher collection",1,0
23017,https://penninehorizons.org/items/show/23017,"Presentation at Mytholmroyd - DEF00198","Group, Mytholmroyd, People, Places, Public Houses, Pubs Inns & Hotels, Taverns","No further information.",,"Pennine Horizons Digital Archive","Pennine Horizons Digital Archive","No date yet","David Fletcher","PHDA - David Fletcher Collection","Pennine Horizons Digital Archive","TIFF file 8-bit","English (U.K.)","Documentary photograph",DEF00198.tif,"Hebden Bridge",,,,,,,,,,,,,,,,,,,,,,,,,,,,,,,,,,,"Group,Mytholmroyd,People,Places,Public Houses,Pubs Inns & Hotels,Taverns",https://penninehorizons.org/files/original/d9307abeb135e88f4ba5a2c003826d22.jpg,"Still Image","David Fletcher collection",1,0
22980,https://penninehorizons.org/items/show/22980,"Public Meeting, Heptonstall - DEF00161","Group, Heptonstall, Meeting, People, Places","Meeting in the Church Hall. Pat Greenwood is the lady on the right in the dark coat,  Joan Laprell is 2nd from left on the front row, and Barbara Jones is in the audience. Date unknown, possibly 1970s.",,"Pennine Horizons Digital Archive","Pennine Horizons Digital Archive","No date yet","David Fletcher","PHDA - David Fletcher Collection","Pennine Horizons Digital Archive","TIFF file 8-bit","English (U.K.)","Documentary photograph",DEF00161.tif,"Hebden Bridge",,,,,,,,,,,,,,,,,,,,,,,,,,,,,,,,,,,"Group,Heptonstall,Meeting,People,Places",https://penninehorizons.org/files/original/ac50059989803e6229613b96595bee30.jpg,"Still Image","David Fletcher collection",1,0
23181,https://penninehorizons.org/items/show/23181,"Public Meeting, St Michael's Mytholmroyd. - DEF00264","Meeting, Mytholmroyd, Places, St Michael's Church",,Unknown,"Pennine Horizons Digital Archive","Pennine Horizons Digital Archive","No date yet","David Fletcher","PHDA - David Fletcher Collection","Pennine Horizons Digital Archive","TIFF file 8-bit","English (U.K.)","Documentary photograph",DEF00264.tif,,,,,,,,,,,,,,,,,,,,,,,,,,,,,,,,,,,,"Meeting,Mytholmroyd,Places,St Michael's Church",https://penninehorizons.org/files/original/6e1e71a1b654b571e4ec4ab49286b4c5.jpg,"Still Image","David Fletcher collection",1,0
22928,https://penninehorizons.org/items/show/22928,"Quick Growing Trees - DEF00107","Mytholmroyd, Places, Trees","Trees planted by Calder Civic Trust at the rear of the Dusty Miller, Mytholmroyd.",,"Pennine Horizons Digital Archive","Pennine Horizons Digital Archive","No date yet","David Fletcher","PHDA - David Fletcher Collection","Pennine Horizons Digital Archive","TIFF file 8-bit","English (U.K.)","Documentary photograph",DEF00107.tif,"Hebden Bridge",,,,,,,,,,,,,,,,,,,,,,,,,,,,,,,,,,,"Mytholmroyd,Places,Trees",https://penninehorizons.org/files/original/724bd84b7b905266a1d4a189af34d5bd.jpg,"Still Image","David Fletcher collection",1,0
23149,https://penninehorizons.org/items/show/23149,"Restoration Underway. - DEF00231","House, Mullions, Yeoman Clothiers House","Bent Head on the Widdop Road.",Unknown,"Pennine Horizons Digital Archive","Pennine Horizons Digital Archive","No date yet","David Fletcher","PHDA - David Fletcher Collection","Pennine Horizons Digital Archive","TIFF file 8-bit","English (U.K.)","Documentary photograph",DEF00231.tif,,,,,,,,,,,,,,,,,,,,,,,,,,,,,,,,,,,,"House,Mullions,Yeoman Clothiers House",https://penninehorizons.org/files/original/a27401b83dea78c2e4d8211bdc3a3fed.jpg,"Still Image","David Fletcher collection",1,0
23164,https://penninehorizons.org/items/show/23164,"Results of River Clean-up, 1968 - DEF00246","Calder Civic Trust, Hebden Bridge, River, Rubbish, litter","Calder Civic Trust annual river clean-up in Hebden Bridge. Can you identify any of these young volunteers?",Unknown,"Pennine Horizons Digital Archive","Pennine Horizons Digital Archive","1968, 1960s","David Fletcher","PHDA - David Fletcher Collection","Pennine Horizons Digital Archive","TIFF file 8-bit","English (U.K.)","Documentary photograph",DEF00246.tif,,,,,,,,,,,,,,,,,,,,,,,,,,,,,,,,,,,,"1960s,Calder Civic Trust,Hebden Bridge,Litter,River,Rubbish",https://penninehorizons.org/files/original/e9fef91273731c44da30279256f75c37.jpg,"Still Image","David Fletcher collection",1,0
22935,https://penninehorizons.org/items/show/22935,"River 1969 - DEF00115","Civic Trust, Hebden Water, River, River Hebden, Rubbish, litter","Probably Hebden Water.",,"Pennine Horizons Digital Archive","Pennine Horizons Digital Archive",1960s,"David Fletcher","PHDA - David Fletcher Collection","Pennine Horizons Digital Archive","TIFF file 8-bit","English (U.K.)","Documentary photograph",DEF00115.tif,"Hebden Bridge",,,,,,,,,,,,,,,,,,,,,,,,,,,,,,,,,,,"1960s,Civic Trust,Hebden Water,Litter,River,River Hebden,Rubbish",https://penninehorizons.org/files/original/9596445a92e58ff25026e820b7786338.jpg,"Still Image","David Fletcher collection",1,0
23001,https://penninehorizons.org/items/show/23001,"River Clean-up, Hebden Bridge. - DEF00182","Calder Civic Trust, Hebden Bridge, Hebden Water, Old Bridge, People at Work, River","The Civic Trust's annual clean-up of Hebden Water in the town centre seen here by the old packhorse bridge.","D. Akrigg","Pennine Horizons Digital Archive","Pennine Horizons Digital Archive","No date yet","David Fletcher","PHDA - David Fletcher Collection","Pennine Horizons Digital Archive","TIFF file 8-bit","English (U.K.)","Documentary photograph",DEF00182.tif,"Hebden Bridge",,,,,,,,,,,,,,,,,,,,,,,,,,,,,,,,,,,"Bridge,Calder Civic Trust,Hebden Bridge,Hebden Water,Old Bridge,People at Work,River",https://penninehorizons.org/files/original/951b26f37cdada9f5e69d832eecb6565.jpg,"Still Image","David Fletcher collection",1,0
22974,https://penninehorizons.org/items/show/22974,"River Cleaning 1968, Hebden Bridge. - DEF00155","Civic Trust, Hebden Bridge, Hebden Water, Old Bridge, River, Rubbish, St Georges Bridge","For several years the Calder Civic Trust organised an annual clean-up of Hebden Water in Hebden Bridge. Viewed here from under the Old Bridge with St Georges Bridge top right.",,"Pennine Horizons Digital Archive","Pennine Horizons Digital Archive",1960s,"David Fletcher","PHDA - David Fletcher Collection","Pennine Horizons Digital Archive","TIFF file 8-bit","English (U.K.)","Documentary photograph",DEF00155.tif,"Hebden Bridge",,,,,,,,,,,,,,,,,,,,,,,,,,,,,,,,,,,"1960s,Civic Trust,Hebden Bridge,Hebden Water,Old Bridge,River,Rubbish,St Georges Bridge",https://penninehorizons.org/files/original/31dba7f5ad960a988ba89229aef9ddbb.jpg,"Still Image","David Fletcher collection",1,0
