﻿"Item Id","Item URI","Dublin Core:Title","Dublin Core:Subject","Dublin Core:Description","Dublin Core:Creator","Dublin Core:Source","Dublin Core:Publisher","Dublin Core:Date","Dublin Core:Contributor","Dublin Core:Rights","Dublin Core:Relation","Dublin Core:Format","Dublin Core:Language","Dublin Core:Type","Dublin Core:Identifier","Dublin Core:Coverage","Item Type Metadata:Lesson Plan Text","Item Type Metadata:Bibliography","Item Type Metadata:Biographical Text","Item Type Metadata:Occupation","Item Type Metadata:Death Date","Item Type Metadata:Birthplace","Item Type Metadata:Birth Date","Item Type Metadata:Participants","Item Type Metadata:Event Type","Item Type Metadata:URL","Item Type Metadata:Bit Rate/Frequency","Item Type Metadata:Interviewer","Item Type Metadata:Interviewee","Item Type Metadata:Location","Item Type Metadata:Transcription","Item Type Metadata:Local URL","Item Type Metadata:Original Format","Item Type Metadata:Physical Dimensions","Item Type Metadata:Duration","Item Type Metadata:Compression","Item Type Metadata:Producer","Item Type Metadata:Director","Item Type Metadata:Text","Item Type Metadata:Time Summary","Item Type Metadata:Email Body","Item Type Metadata:Subject Line","Item Type Metadata:From","Item Type Metadata:To","Item Type Metadata:CC","Item Type Metadata:BCC","Item Type Metadata:Number of Attachments","Item Type Metadata:Standards","Item Type Metadata:Objectives","Item Type Metadata:Materials",tags,file,itemType,collection,public,featured
18530,https://penninehorizons.org/items/show/18530,"Hebble End Bridge, Hebden Bridge - JET00112","Bridge, Hebble End, Hebden Bridge, Places, Rochdale Canal, Street Names","Part of the work required for the re-opening of the Rochdale Canal.",,"Pennine Horizons Digital Archive","Pennine Horizons Digital Archive","No date yet","Jeanette Thomas","PHDA - Jeanette Thomas Collection","Pennine Horizons Digital Archive","TIFF file 8-bit","English (U.K.)","Documentary photograph",JET00112.tif,,,,,,,,,,,,,,,,,,,,,,,,,,,,,,,,,,,,"Bridge,Hebble End,Hebden Bridge,Places,Rochdale Canal,Street Names",https://penninehorizons.org/files/original/58e76b10af0dd87f92f7155e54a7af5c.jpg,"Still Image","Jeanette Thomas collection",1,0
18529,https://penninehorizons.org/items/show/18529,"Demolition of Melbourne Mill, Market Street, Hebden Bridge - JET00111","Buildings, Demolition, Hebden Bridge, Market Street, Melbourne Mill, Places, Street Names",,,"Pennine Horizons Digital Archive","Pennine Horizons Digital Archive","No date yet","Jeanette Thomas","PHDA - Jeanette Thomas Collection","Pennine Horizons Digital Archive","TIFF file 8-bit","English (U.K.)","Documentary photograph",JET00111.tif,,,,,,,,,,,,,,,,,,,,,,,,,,,,,,,,,,,,"Buildings,Demolition,Hebden Bridge,Market Street,Melbourne Mill,Places,Street Names",https://penninehorizons.org/files/original/ec3c956bb1fcd623e149475b3b1c95ed.jpg,"Still Image","Jeanette Thomas collection",1,0
18528,https://penninehorizons.org/items/show/18528,"Building Burdock Way, Halifax - JET00110","Buildings, Construction, Halifax, North Bridge, Places",,,"Pennine Horizons Digital Archive","Pennine Horizons Digital Archive","No date yet","Jeanette Thomas","PHDA - Jeanette Thomas Collection","Pennine Horizons Digital Archive","TIFF file 8-bit","English (U.K.)","Documentary photograph",JET00110.tif,,,,,,,,,,,,,,,,,,,,,,,,,,,,,,,,,,,,"Buildings,Construction,Halifax,North Bridge,Places",https://penninehorizons.org/files/original/0ed04e2203345f33bc73336cc768cda3.jpg,"Still Image","Jeanette Thomas collection",1,0
18527,https://penninehorizons.org/items/show/18527,"North Bridge, Halifax - JET00109","Bridge, Buildings, Bus, Cooling tower, Halifax, North Bridge, Places, Road, Transport",,,"Pennine Horizons Digital Archive","Pennine Horizons Digital Archive","No date yet","Jeanette Thomas","PHDA - Jeanette Thomas Collection","Pennine Horizons Digital Archive","TIFF file 8-bit","English (U.K.)","Documentary photograph",JET00109.tif,,,,,,,,,,,,,,,,,,,,,,,,,,,,,,,,,,,,"Bridge,Buildings,Bus,Cooling tower,Halifax,North Bridge,Places,Road,Transport",https://penninehorizons.org/files/original/8ff76187f8e106912b1a7135910ffe1b.jpg,"Still Image","Jeanette Thomas collection",1,0
18525,https://penninehorizons.org/items/show/18525,"Hebden Bridge Scouts - JET00107","Group, People, Portrait, Studio, Uniform","Mr George Nicholls, leader.",,"Pennine Horizons Digital Archive","Pennine Horizons Digital Archive","No date yet","Jeanette Thomas","PHDA - Jeanette Thomas Collection","Pennine Horizons Digital Archive","TIFF file 8-bit","English (U.K.)","Documentary photograph",JET00107.tif,,,,,,,,,,,,,,,,,,,,,,,,,,,,,,,,,,,,"Group,People,Portrait,Studio,Uniform",https://penninehorizons.org/files/original/5ccba6f29653b005e2a4086d9483c12f.jpg,"Still Image","Jeanette Thomas collection",1,0
18524,https://penninehorizons.org/items/show/18524,"Scouts at Blakedean - JET00106","Scouts, Uniform",,,"Pennine Horizons Digital Archive","Pennine Horizons Digital Archive","No date yet","Jeanette Thomas","PHDA - Jeanette Thomas Collection","Pennine Horizons Digital Archive","TIFF file 8-bit","English (U.K.)","Documentary photograph",JET00106.tif,,,,,,,,,,,,,,,,,,,,,,,,,,,,,,,,,,,,"Scouts,Uniform",https://penninehorizons.org/files/original/c4bc765de19ee9618d02f2180dcc7841.jpg,"Still Image","Jeanette Thomas collection",1,0
18523,https://penninehorizons.org/items/show/18523,"Scouts off to Camp - JET00105","Boys, Scouts, Uniform","The leader was Mr George Nicholls.",,"Pennine Horizons Digital Archive","Pennine Horizons Digital Archive","No date yet","Jeanette Thomas","PHDA - Jeanette Thomas Collection","Pennine Horizons Digital Archive","TIFF file 8-bit","English (U.K.)","Documentary photograph",JET00105.tif,,,,,,,,,,,,,,,,,,,,,,,,,,,,,,,,,,,,"Scouts,Uniform",https://penninehorizons.org/files/original/fdd448c19f48ef86aff076f5c919e22c.jpg,"Still Image","Jeanette Thomas collection",1,0
18522,https://penninehorizons.org/items/show/18522,"Akroyd, Pecket Well - JET00104","Akroyd, Architecture, Buildings, Pecket Well","Taken 17th August, 1914.","George Hepworth, Brighouse.","Pennine Horizons Digital Archive","Pennine Horizons Digital Archive",1910s,"Jeanette Thomas","PHDA - Jeanette Thomas Collection","Pennine Horizons Digital Archive","TIFF file 8-bit","English (U.K.)","Documentary photograph",JET00104.tif,,,,,,,,,,,,,,,,,,,,,,,,,,,,,,,,,,,,"1910s,Akroyd,Architecture,Buildings,Pecket Well",https://penninehorizons.org/files/original/2cbcef8569178e63ab7e833246c0129d.jpg,"Still Image","Jeanette Thomas collection",1,0
18520,https://penninehorizons.org/items/show/18520,"Family Portrait - JET00102","Group, People, Portrait",,"E. Greaves, Halifax","Pennine Horizons Digital Archive","Pennine Horizons Digital Archive","No date yet","Jeanette Thomas","PHDA - Jeanette Thomas Collection","Pennine Horizons Digital Archive","TIFF file 8-bit","English (U.K.)","Documentary photograph",JET00102.tif,,,,,,,,,,,,,,,,,,,,,,,,,,,,,,,,,,,,"Group,People,Portrait",https://penninehorizons.org/files/original/ade2ce4cd55b49ff28902bdb3bf1197d.jpg,"Still Image","Jeanette Thomas collection",1,0
18519,https://penninehorizons.org/items/show/18519,"View of Hebden Bridge from Fairfield - JET00101","Buildings, Hebden Bridge, Holme House, Hope Baptist, Rochdale Canal, Stubbing School",,"Thomas gibson Crown Street, Hebden Bridge","Pennine Horizons Digital Archive","Pennine Horizons Digital Archive","No date yet","Jeanette Thomas","PHDA - Jeanette Thomas Collection","Pennine Horizons Digital Archive","TIFF file 8-bit","English (U.K.)","Documentary photograph",JET00101.tif,,,,,,,,,,,,,,,,,,,,,,,,,,,,,,,,,,,,"Buildings,Hebden Bridge,Holme House,Hope Baptist,Rochdale Canal,Stubbing School",https://penninehorizons.org/files/original/b18b3347a4b37feaf37a0cbf47ce6319.jpg,"Still Image","Jeanette Thomas collection",1,0
