﻿"Item Id","Item URI","Dublin Core:Title","Dublin Core:Subject","Dublin Core:Description","Dublin Core:Creator","Dublin Core:Source","Dublin Core:Publisher","Dublin Core:Date","Dublin Core:Contributor","Dublin Core:Rights","Dublin Core:Relation","Dublin Core:Format","Dublin Core:Language","Dublin Core:Type","Dublin Core:Identifier","Dublin Core:Coverage","Item Type Metadata:Lesson Plan Text","Item Type Metadata:Bibliography","Item Type Metadata:Biographical Text","Item Type Metadata:Occupation","Item Type Metadata:Death Date","Item Type Metadata:Birthplace","Item Type Metadata:Birth Date","Item Type Metadata:Participants","Item Type Metadata:Event Type","Item Type Metadata:URL","Item Type Metadata:Bit Rate/Frequency","Item Type Metadata:Interviewer","Item Type Metadata:Interviewee","Item Type Metadata:Location","Item Type Metadata:Transcription","Item Type Metadata:Local URL","Item Type Metadata:Original Format","Item Type Metadata:Physical Dimensions","Item Type Metadata:Duration","Item Type Metadata:Compression","Item Type Metadata:Producer","Item Type Metadata:Director","Item Type Metadata:Text","Item Type Metadata:Time Summary","Item Type Metadata:Email Body","Item Type Metadata:Subject Line","Item Type Metadata:From","Item Type Metadata:To","Item Type Metadata:CC","Item Type Metadata:BCC","Item Type Metadata:Number of Attachments","Item Type Metadata:Standards","Item Type Metadata:Objectives","Item Type Metadata:Materials",tags,file,itemType,collection,public,featured
23022,https://penninehorizons.org/items/show/23022,"Aerial view of Mytholmroyd - THB00102","Aerial View, Agricultural buildings, Agriculture, Farm, Farm house, Farmhouse, Farming, Farms, Mytholmroyd, Places, Thornbers","View of Mytholmroyd with Thornber's holdings identified. A is Top Land, The Hatchery on Hall Bank Lane, C is Square Works, D is Elphaborough, and D Dean Hey.","Aerofilms Ltd.","Pennine Horizons Digital Archive","Pennine Horizons Digital Archive","No date yet",Thorbers,"PHDA - The Thornber Collection","Pennine Horizons Digital Archive","TIFF file 8-bit","English (U.K.)","Documentary photograph",THB00102.tif,,,,,,,,,,,,,,,,,,,,,,,,,,,,,,,,,,,,"Aerial View,Agriculture,Farm,Farm house,Farmhouse,Farming,Farms,Mytholmroyd,Places,Thornbers",https://penninehorizons.org/files/original/1f3105dccd05f03afb15b70d496c253b.jpg,"Still Image","Thornbers collection",1,0
23023,https://penninehorizons.org/items/show/23023,"Newhouse Farm - THB00103","Aerial View, Agricultural buildings, Agriculture, Farm, Farm house, Farmhouse, Farming, Farms, Mytholmroyd, Places, Poultry, Thornbers",,"Aerofilms Ltd.","Pennine Horizons Digital Archive","Pennine Horizons Digital Archive","No date yet",Thorbers,"PHDA - The Thornber Collection","Pennine Horizons Digital Archive","TIFF file 8-bit","English (U.K.)","Documentary photograph",THB00103.tif,,,,,,,,,,,,,,,,,,,,,,,,,,,,,,,,,,,,"Aerial View,Agriculture,Farm,Farm house,Farmhouse,Farming,Farms,Mytholmroyd,Places,Poultry,Thornbers",https://penninehorizons.org/files/original/9e91cea5ebf70db80bc799005211158e.jpg,"Still Image","Thornbers collection",1,0
23024,https://penninehorizons.org/items/show/23024,"Aerial view of Mytholmroyd - THB00104","Aerial View, Agricultural buildings, Agriculture, Farm, Farm house, Farmhouse, Farming, Farms, Mytholmroyd, Places, Poultry, Thornbers","An aerial view showing Thorber's breeding pens. Banksfield Estate is top left; the railway line crosses the picture and the sidings with many trucks can be seen.","Aerofilms Ltd.","Pennine Horizons Digital Archive","Pennine Horizons Digital Archive","No date yet",Thorbers,"PHDA - The Thornber Collection","Pennine Horizons Digital Archive","TIFF file 8-bit","English (U.K.)","Documentary photograph",THB00104.tif,,,,,,,,,,,,,,,,,,,,,,,,,,,,,,,,,,,,"Aerial View,Agriculture,Farm,Farm house,Farmhouse,Farming,Farms,Mytholmroyd,Places,Poultry,Thornbers",https://penninehorizons.org/files/original/23dab25201019085ecb947001d6a5d4b.jpg,"Still Image","Thornbers collection",1,0
23025,https://penninehorizons.org/items/show/23025,"Aerial view of Dean Hey - THB00105","Agricultural buildings, Agriculture, Farm, Farm house, Farmhouse, Farming, Farms, Mytholmroyd, Places, Poultry, Thornbers",,"Aerofilms Ltd.","Pennine Horizons Digital Archive","Pennine Horizons Digital Archive","No date yet",Thorbers,"PHDA - The Thornber Collection","Pennine Horizons Digital Archive","TIFF file 8-bit","English (U.K.)","Documentary photograph",THB00105.tif,,,,,,,,,,,,,,,,,,,,,,,,,,,,,,,,,,,,"Agriculture,Farm,Farm house,Farmhouse,Farming,Farms,Mytholmroyd,Places,Poultry,Thornbers",https://penninehorizons.org/files/original/71aa6fc9b006ebd21bdcee19acef0ae3.jpg,"Still Image","Thornbers collection",1,0
23026,https://penninehorizons.org/items/show/23026,"Aerial view of Mytholmroyd - THB00106","Aerial View, Agricultural buildings, Agriculture, Elphaborough, Mytholmroyd, Places, Scarbottom Mill","Detail of THB00106 showing Top Land, Square Works and Elphaborough. Also shows Scarbottom Mill.","Aerofilms Ltd.","Pennine Horizons Digital Archive","Pennine Horizons Digital Archive","No date yet",Thorbers,"PHDA - The Thornber Collection","Pennine Horizons Digital Archive","TIFF file 8-bit","English (U.K.)","Documentary photograph",THB00106.tif,,,,,,,,,,,,,,,,,,,,,,,,,,,,,,,,,,,,"Aerial View,Agriculture,Elphaborough,Mytholmroyd,Places,Scarbottom Mill",https://penninehorizons.org/files/original/606304e44b13170871284bd630dfde16.jpg,"Still Image","Thornbers collection",1,0
23027,https://penninehorizons.org/items/show/23027,"Aerial view of Mytholmroyd - THB00107","Agricultural buildings, Agriculture, Elphaborough, Farm, Farm house, Farmhouse, Farming, Farms, Mytholmroyd, Places, Scarbottom Mill, Scout Rocks",,"Aerofilms Ltd.","Pennine Horizons Digital Archive","Pennine Horizons Digital Archive","No date yet",Thorbers,"PHDA - The Thornber Collection","Pennine Horizons Digital Archive","TIFF file 8-bit","English (U.K.)","Documentary photograph",THB00107.tif,,,,,,,,,,,,,,,,,,,,,,,,,,,,,,,,,,,,"Agriculture,Elphaborough,Farm,Farm house,Farmhouse,Farming,Farms,Mytholmroyd,Places,Scarbottom Mill,Scout Rocks",https://penninehorizons.org/files/original/b59104a078c6f06e7d9727737de7dc9c.jpg,"Still Image","Thornbers collection",1,0
23079,https://penninehorizons.org/items/show/23079,"Aerial View of Mytholmroyd - THB00160","Aerial View, Agricultural buildings, Agriculture, Elphaborough, Mytholmroyd, Places, Scarbottom Mill, Square Works","Bottom left are the brooder houses at Elphaborough and centre is Scarbottom Mill.  Towards the top on the left is Square Works, which was originally part of Maude's Clog Soles, but after the death of James Maude the mill was bought by Thornbers and was used for the production of wooden buildings and other equipment. The main hatchery is top right.","Aerofilms Ltd.","Pennine Horizons Digital Archive","Pennine Horizons Digital Archive","No date yet",Thorbers,"PHDA - The Thornber Collection","Pennine Horizons Digital Archive","TIFF file 8-bit","English (U.K.)","Documentary photograph",THB00160.TIF,,,,,,,,,,,,,,,,,,,,,,,,,,,,,,,,,,,,"Aerial View,Agriculture,Elphaborough,Mytholmroyd,Places,Scarbottom Mill,Square Works",https://penninehorizons.org/files/original/9f1db54f754b29024f1cdb3ed3d0a46b.jpg,"Still Image","Thornbers collection",1,0
23080,https://penninehorizons.org/items/show/23080,"Aerial View of Mytholmroyd - THB00161","Aerial View, Agricultural buildings, Agriculture, Clevelleys Gardens, Elphaborough, Hall Bank Lane, Mytholmroyd, Places, Scarbottom Mill, Scout Rocks, Square Works","Elphaborough is on the bottom left of the picture, Hall Bank Lane winds its way across and up the picture. The fields are divided into neat areas for controlled breeding.","Aerofilms Ltd.","Pennine Horizons Digital Archive","Pennine Horizons Digital Archive","No date yet",Thorbers,"PHDA - The Thornber Collection","Pennine Horizons Digital Archive","TIFF file 8-bit","English (U.K.)","Documentary photograph",THB00161.TIF,,,,,,,,,,,,,,,,,,,,,,,,,,,,,,,,,,,,"Aerial View,Agriculture,Clevelleys Gardens,Elphaborough,Hall Bank Lane,Mytholmroyd,Places,Scarbottom Mill,Scout Rocks,Square Works",https://penninehorizons.org/files/original/fea8ec5f28bf0229b2fee86f907105db.jpg,"Still Image","Thornbers collection",1,0
23081,https://penninehorizons.org/items/show/23081,"Aerial View of Mytholmroyd - THB00162","Aerial View, Agricultural buildings, Agriculture, Clevelleys Gardens, Elphaborough, Hall Bank Lane, Mytholmroyd, Places, Scarbottom Mill, Scout Rocks, Square Works","Elphaborough is on the bottom left of the picture, Hall Bank Lane winds its way across and up the picture. The fields are divided into neat areas for controlled breeding.","Aerofilms Ltd.","Pennine Horizons Digital Archive","Pennine Horizons Digital Archive","No date yet",Thorbers,"PHDA - The Thornber Collection","Pennine Horizons Digital Archive","TIFF file 8-bit","English (U.K.)","Documentary photograph",THB00162.TIF,,,,,,,,,,,,,,,,,,,,,,,,,,,,,,,,,,,,"Aerial View,Agriculture,Clevelleys Gardens,Elphaborough,Hall Bank Lane,Mytholmroyd,Places,Scarbottom Mill,Scout Rocks,Square Works",https://penninehorizons.org/files/original/8fd28262478430f8333f49b4847b3894.jpg,"Still Image","Thornbers collection",1,0
23082,https://penninehorizons.org/items/show/23082,"Aerial View of a Model Hatchery - THB00163","Aerial View, Agricultural buildings, Agriculture, Hatchery",,"Aerofilms Ltd.","Pennine Horizons Digital Archive","Pennine Horizons Digital Archive","No date yet",Thorbers,"PHDA - The Thornber Collection","Pennine Horizons Digital Archive","TIFF file 8-bit","English (U.K.)","Documentary photograph",THB00163.TIF,,,,,,,,,,,,,,,,,,,,,,,,,,,,,,,,,,,,"Aerial View,Agriculture,Hatchery",https://penninehorizons.org/files/original/126d5fc9d330e045397c9fc2fa10ed73.jpg,"Still Image","Thornbers collection",1,0
23083,https://penninehorizons.org/items/show/23083,"Aerial View of Breeding Pens - THB00164","Aerial View, Agricultural buildings, Agriculture, Poultry","Unknown location.","Aerofilms Ltd.","Pennine Horizons Digital Archive","Pennine Horizons Digital Archive","No date yet",Thorbers,"PHDA - The Thornber Collection","Pennine Horizons Digital Archive","TIFF file 8-bit","English (U.K.)","Documentary photograph",THB00164.TIF,,,,,,,,,,,,,,,,,,,,,,,,,,,,,,,,,,,,"Aerial View,Agriculture,Poultry",https://penninehorizons.org/files/original/49576350418ef7ab6fc6611464feed32.jpg,"Still Image","Thornbers collection",1,0
23084,https://penninehorizons.org/items/show/23084,"Aerial View of Breeding Pens - THB00165","Aerial View, Agricultural buildings, Agriculture, Hatchery, Poultry, Thornbers",,"Aerofilms Ltd.","Pennine Horizons Digital Archive","Pennine Horizons Digital Archive","No date yet",Thorbers,"PHDA - The Thornber Collection","Pennine Horizons Digital Archive","TIFF file 8-bit","English (U.K.)","Documentary photograph",THB00165.TIF,,,,,,,,,,,,,,,,,,,,,,,,,,,,,,,,,,,,"Aerial View,Agriculture,Hatchery,Poultry,Thornbers",https://penninehorizons.org/files/original/8326fac63ee5d2881dbd5ce51bfd8cc5.jpg,"Still Image","Thornbers collection",1,0
23085,https://penninehorizons.org/items/show/23085,"Aerial View of Breeding Pens - THB00166","Aerial View, Agricultural buildings, Agriculture, Poultry, Thornbers","Unknown location.","Aerofilms Ltd.","Pennine Horizons Digital Archive","Pennine Horizons Digital Archive","No date yet",Thorbers,"PHDA - The Thornber Collection","Pennine Horizons Digital Archive","TIFF file 8-bit","English (U.K.)","Documentary photograph",THB00166.TIF,,,,,,,,,,,,,,,,,,,,,,,,,,,,,,,,,,,,"Aerial View,Agriculture,Poultry,Thornbers",https://penninehorizons.org/files/original/cc7363fea08d9609c6fd953eb6dfe31c.jpg,"Still Image","Thornbers collection",1,0
23086,https://penninehorizons.org/items/show/23086,"Aerial View of Breeding Pens - THB00167","Aerial View, Agricultural buildings, Agriculture, Poultry, Thornbers",,"Aerofilms Ltd.","Pennine Horizons Digital Archive","Pennine Horizons Digital Archive","No date yet",Thorbers,"PHDA - The Thornber Collection","Pennine Horizons Digital Archive","TIFF file 8-bit","English (U.K.)","Documentary photograph",THB00167.TIF,,,,,,,,,,,,,,,,,,,,,,,,,,,,,,,,,,,,"Aerial View,Agriculture,Poultry,Thornbers",https://penninehorizons.org/files/original/3283256f249e9caa9045b17f726ee6ab.jpg,"Still Image","Thornbers collection",1,0
23087,https://penninehorizons.org/items/show/23087,"Aerial View of Breeding Pens - THB00168","Aerial View, Agricultural buildings, Agriculture, Poultry","Unknown location.","Aerofilms Ltd.","Pennine Horizons Digital Archive","Pennine Horizons Digital Archive","No date yet",Thorbers,"PHDA - The Thornber Collection","Pennine Horizons Digital Archive","TIFF file 8-bit","English (U.K.)","Documentary photograph",THB00168.TIF,,,,,,,,,,,,,,,,,,,,,,,,,,,,,,,,,,,,"Aerial View,Agriculture,Poultry",https://penninehorizons.org/files/original/2b84bc546f699cb490ab1548381ad37c.jpg,"Still Image","Thornbers collection",1,0
23088,https://penninehorizons.org/items/show/23088,"Aerial View of Retford Hatchery - THB00169","Aerial View, Agricultural buildings, Agriculture, Farm, Farm house, Farmhouse, Farming, Farms",,"Aerofilms Ltd.","Pennine Horizons Digital Archive","Pennine Horizons Digital Archive","No date yet",Thorbers,"PHDA - The Thornber Collection","Pennine Horizons Digital Archive","TIFF file 8-bit","English (U.K.)","Documentary photograph",THB00169.TIF,,,,,,,,,,,,,,,,,,,,,,,,,,,,,,,,,,,,"Aerial View,Agriculture,Farm,Farm house,Farmhouse,Farming,Farms",https://penninehorizons.org/files/original/16bf38c0330059c4f89f41d5453d946f.jpg,"Still Image","Thornbers collection",1,0
23089,https://penninehorizons.org/items/show/23089,"Aerial View of Retford Hatchery - THB00170","Aerial View, Agricultural buildings, Agriculture, Farm, Farm house, Farmhouse, Farming, Farms, Hatchery, Poultry",,"Aerofilms Ltd.","Pennine Horizons Digital Archive","Pennine Horizons Digital Archive","No date yet",Thorbers,"PHDA - The Thornber Collection","Pennine Horizons Digital Archive","TIFF file 8-bit","English (U.K.)","Documentary photograph",THB00170.TIF,,,,,,,,,,,,,,,,,,,,,,,,,,,,,,,,,,,,"Aerial View,Agriculture,Farm,Farm house,Farmhouse,Farming,Farms,Hatchery,Poultry",https://penninehorizons.org/files/original/1309eae06ce1974199b1171dabef7fc7.jpg,"Still Image","Thornbers collection",1,0
23090,https://penninehorizons.org/items/show/23090,"Aerial View of Breeding Pens - THB00171","Aerial View, Agricultural buildings, Agriculture, Farm, Farm house, Farmhouse, Farming, Farms, Poultry","Unknown location.","Aerofilms Ltd.","Pennine Horizons Digital Archive","Pennine Horizons Digital Archive","No date yet",Thorbers,"PHDA - The Thornber Collection","Pennine Horizons Digital Archive","TIFF file 8-bit","English (U.K.)","Documentary photograph",THB00171.TIF,,,,,,,,,,,,,,,,,,,,,,,,,,,,,,,,,,,,"Aerial View,Agriculture,Farm,Farm house,Farmhouse,Farming,Farms,Poultry",https://penninehorizons.org/files/original/7497055ee739cc7e21b488ffdd8f2d03.jpg,"Still Image","Thornbers collection",1,0
23091,https://penninehorizons.org/items/show/23091,"Aerial View of Breeding Pens - THB00172","Agricultural buildings, Agriculture, Farm, Farm house, Farmhouse, Farming, Farms, Poultry, Thornbers","Unknown location.","Aerofilms Ltd.","Pennine Horizons Digital Archive","Pennine Horizons Digital Archive","No date yet",Thorbers,"PHDA - The Thornber Collection","Pennine Horizons Digital Archive","TIFF file 8-bit","English (U.K.)","Documentary photograph",THB00172.TIF,,,,,,,,,,,,,,,,,,,,,,,,,,,,,,,,,,,,"Agriculture,Farm,Farm house,Farmhouse,Farming,Farms,Poultry,Thornbers",https://penninehorizons.org/files/original/75c2a3183d87129acb4babc5066b83eb.jpg,"Still Image","Thornbers collection",1,0
23092,https://penninehorizons.org/items/show/23092,"Aerial View of a Hatchery - THB00173","Aerial View, Agricultural buildings, Agriculture, Farm, Farm house, Farmhouse, Farming, Farms, Poultry, Thornbers","Unknown location.","Aerofilms Ltd.","Pennine Horizons Digital Archive","Pennine Horizons Digital Archive","No date yet",Thorbers,"PHDA - The Thornber Collection","Pennine Horizons Digital Archive","TIFF file 8-bit","English (U.K.)","Documentary photograph",THB00173.TIF,,,,,,,,,,,,,,,,,,,,,,,,,,,,,,,,,,,,"Aerial View,Agriculture,Farm,Farm house,Farmhouse,Farming,Farms,Poultry,Thornbers",https://penninehorizons.org/files/original/1ad0ba4adfc8ce8a2126c2c9c8263fcd.jpg,"Still Image","Thornbers collection",1,0
23093,https://penninehorizons.org/items/show/23093,"Aerial View of a Hatchery - THB00174","Aerial View, Agricultural buildings, Agriculture, Farm, Farm house, Farmhouse, Farming, Farms, Hatchery, Poultry, Thornbers","Unknown location.","Aerofilms Ltd.","Pennine Horizons Digital Archive","Pennine Horizons Digital Archive","No date yet",Thorbers,"PHDA - The Thornber Collection","Pennine Horizons Digital Archive","TIFF file 8-bit","English (U.K.)","Documentary photograph",THB00174.TIF,,,,,,,,,,,,,,,,,,,,,,,,,,,,,,,,,,,,"Aerial View,Agriculture,Farm,Farm house,Farmhouse,Farming,Farms,Hatchery,Poultry,Thornbers",https://penninehorizons.org/files/original/1c9cbf71c3d865096ce4f31b647a7be8.jpg,"Still Image","Thornbers collection",1,0
23094,https://penninehorizons.org/items/show/23094,"Aerial View of a Hatchery - THB00175","Aerial View, Agricultural buildings, Agriculture, Farm, Farm house, Farmhouse, Farming, Farms, Hatchery, Poultry, Thornbers","Unknown location.","Aerofilms Ltd.","Pennine Horizons Digital Archive","Pennine Horizons Digital Archive","No date yet",Thorbers,"PHDA - The Thornber Collection","Pennine Horizons Digital Archive","TIFF file 8-bit","English (U.K.)","Documentary photograph",THB00175.TIF,,,,,,,,,,,,,,,,,,,,,,,,,,,,,,,,,,,,"Aerial View,Agriculture,Farm,Farm house,Farmhouse,Farming,Farms,Hatchery,Poultry,Thornbers",https://penninehorizons.org/files/original/c156ead7ba4ecb546e584b1f8914bee5.jpg,"Still Image","Thornbers collection",1,0
23095,https://penninehorizons.org/items/show/23095,"Aerial View of Mytholmroyd - THB00176","Aerial View, Agricultural buildings, Agriculture, Farm, Farm house, Farmhouse, Farming, Farms, Hatchery, Mill Dam, Mytholmroyd, Places, Poultry, Railway, Railway Sidings, Railways, Scarbottom Mill, Scout Rocks, Thornbers","Showing the Thornber breeding pens. Note the railway sidings.","Aerofilms Ltd.","Pennine Horizons Digital Archive","Pennine Horizons Digital Archive","No date yet",Thorbers,"PHDA - The Thornber Collection","Pennine Horizons Digital Archive","TIFF file 8-bit","English (U.K.)","Documentary photograph",THB00176.TIF,,,,,,,,,,,,,,,,,,,,,,,,,,,,,,,,,,,,"Aerial View,Agriculture,Farm,Farm house,Farmhouse,Farming,Farms,Hatchery,Mill Dam,Mytholmroyd,Places,Poultry,Railway,Railway Sidings,Railways,Scarbottom Mill,Scout Rocks,Thornbers",https://penninehorizons.org/files/original/426fb00c4c13ca11245705c2448446e5.jpg,"Still Image","Thornbers collection",1,0
23096,https://penninehorizons.org/items/show/23096,"Mytholmroyd - THB00177","Aerial View, Agricultural buildings, Agriculture, Farm, Farm house, Farmhouse, Farming, Farms, Hatchery, Mill Dam, Mytholmroyd, Places, Poultry, Railway, Railway Sidings, Railways","Cragg road runs across the bottom of the picture, and Dean Hey is to the bottom right of the picture.","Aerofilms Ltd.","Pennine Horizons Digital Archive","Pennine Horizons Digital Archive","No date yet",Thorbers,"PHDA - The Thornber Collection","Pennine Horizons Digital Archive","TIFF file 8-bit","English (U.K.)","Documentary photograph",THB00177.TIF,,,,,,,,,,,,,,,,,,,,,,,,,,,,,,,,,,,,"Aerial View,Agriculture,Farm,Farm house,Farmhouse,Farming,Farms,Hatchery,Mill Dam,Mytholmroyd,Places,Poultry,Railway,Railway Sidings,Railways",https://penninehorizons.org/files/original/393c83dca24b36b781c23cc450f6fd02.jpg,"Still Image","Thornbers collection",1,0
23097,https://penninehorizons.org/items/show/23097,"Aerial View of Breeding Pens and Hatchery - THB00178","Aerial View, Agricultural buildings, Agriculture, Farm, Farm house, Farmhouse, Farming, Farms, Hatchery, Poultry, Thornbers","Unknown location.","Aerofilms Ltd.","Pennine Horizons Digital Archive","Pennine Horizons Digital Archive","No date yet",Thorbers,"PHDA - The Thornber Collection","Pennine Horizons Digital Archive","TIFF file 8-bit","English (U.K.)","Documentary photograph",THB00178.TIF,,,,,,,,,,,,,,,,,,,,,,,,,,,,,,,,,,,,"Aerial View,Agriculture,Farm,Farm house,Farmhouse,Farming,Farms,Hatchery,Poultry,Thornbers",https://penninehorizons.org/files/original/c4252a295274745f8e7b9467a96d923d.jpg,"Still Image","Thornbers collection",1,0
