﻿"Item Id","Item URI","Dublin Core:Title","Dublin Core:Subject","Dublin Core:Description","Dublin Core:Creator","Dublin Core:Source","Dublin Core:Publisher","Dublin Core:Date","Dublin Core:Contributor","Dublin Core:Rights","Dublin Core:Relation","Dublin Core:Format","Dublin Core:Language","Dublin Core:Type","Dublin Core:Identifier","Dublin Core:Coverage","Item Type Metadata:Lesson Plan Text","Item Type Metadata:Bibliography","Item Type Metadata:Biographical Text","Item Type Metadata:Occupation","Item Type Metadata:Death Date","Item Type Metadata:Birthplace","Item Type Metadata:Birth Date","Item Type Metadata:Participants","Item Type Metadata:Event Type","Item Type Metadata:URL","Item Type Metadata:Bit Rate/Frequency","Item Type Metadata:Interviewer","Item Type Metadata:Interviewee","Item Type Metadata:Location","Item Type Metadata:Transcription","Item Type Metadata:Local URL","Item Type Metadata:Original Format","Item Type Metadata:Physical Dimensions","Item Type Metadata:Duration","Item Type Metadata:Compression","Item Type Metadata:Producer","Item Type Metadata:Director","Item Type Metadata:Text","Item Type Metadata:Time Summary","Item Type Metadata:Email Body","Item Type Metadata:Subject Line","Item Type Metadata:From","Item Type Metadata:To","Item Type Metadata:CC","Item Type Metadata:BCC","Item Type Metadata:Number of Attachments","Item Type Metadata:Standards","Item Type Metadata:Objectives","Item Type Metadata:Materials",tags,file,itemType,collection,public,featured
24618,https://penninehorizons.org/items/show/24618,"Judy Brigg, Sowden Lane, Norwood Green - TWA00231","River, Norwood Green","“JUDY BRIG” or HORSE CLOSE BRIDGE, is a one-arch stone bridge in Royds Hall Woods. It was named after a woman called Judy North colloquially known from her size as “Gurt Judy.” At one time there were pleasure gardens at this place.

Royds Hall Beck is the boundary between Calderdale on left and Bradford on the right.","Tom Walker","Olwen Forest","Pennine Horizons Digital Archive","1960 , 1960s","Olwen Forest","PHDA - Tom Walker Collection","Pennine Horizons Digital Archive","TIFF file 8-bit","English (U.K.)","Documentary photograph",TWA00231.tif,,,,,,,,,,,,,,,,,,,,,,,,,,,,,,,,,,,,"Norwood Green,River",https://penninehorizons.org/files/original/ebdf94f4bd51862f1cdf5a2aff794c9c.jpg,"Still Image","Tom Walker collection",1,0
24619,https://penninehorizons.org/items/show/24619,"Jumples Bridge, Mixenden - TWA00232","Bridge, Mixenden, River, Tom Walker","JUMPLES BRIDGE Mixenden. There has been a bridge at Jumples for centuries. A deed dated 1494 refers to “between a house late held by Richard Burnley on the south and Jompyll brigg on the north . . . “ In 1595 William Lister had a mill at Jumples Bridge. In his will dated 1723 George Ramsden described himself as a clothier of Jumple Mill. In addition to the present stone-arch bridge there is a foot-bridge higher up the stream which appears to have had a handrail at one time since there are postholes in the single slab of stone.","Tom Walker","Olwen Forest","Pennine Horizons Digital Archive","1960 , 1960s","Olwen Forest","PHDA - Tom Walker Collection","Pennine Horizons Digital Archive","TIFF file 8-bit","English (U.K.)","Documentary photograph",TWA00232.tif,,,,,,,,,,,,,,,,,,,,,,,,,,,,,,,,,,,,"Bridge,Mixenden,River,Tom Walker",https://penninehorizons.org/files/original/5f4eb357f03e1fda045129f299f1536f.jpg,"Still Image","Tom Walker collection",1,0
24620,https://penninehorizons.org/items/show/24620,"Lane House Bridge, Luddenden - TWA00233","Bridge, River, Tom Walker","LANE HOUSE BRIDGE is a narrow stone foot-bridge near Lane House between Kershaw House and Luddenden village, over the Lud Brook. It was repairable by Luddenden and Midgley. In 1768, in December, 1s 0d was paid for mending the “wood bridge” at Lane house.","Tom Walker","Olwen Forest","Pennine Horizons Digital Archive","1960 , 1960s","Olwen Forest","PHDA - Tom Walker Collection","Pennine Horizons Digital Archive","TIFF file 8-bit","English (U.K.)","Documentary photograph",TWA00233.tif,,,,,,,,,,,,,,,,,,,,,,,,,,,,,,,,,,,,"Bridge,River,Tom Walker",https://penninehorizons.org/files/original/a1449ae69d2d6d2dc5604a1b7f0be4c9.jpg,"Still Image","Tom Walker collection",1,0
24621,https://penninehorizons.org/items/show/24621,"Lily Bridge - TWA00234","Bridge, River, Tom Walker","At Lily Bridge in close proximity to the railway station there used to be open air baths, “the most extensive suite of baths in Yorkshire.” There is now an iron bridge over the railway lines, and a stone bridge of two arches over the brook. A. Comfort’s drawing of the Bath Tavern is viewed from Lily Bridge.","Tom Walker","Olwen Forest","Pennine Horizons Digital Archive","1960 , 1960s","Olwen Forest","PHDA - Tom Walker Collection","Pennine Horizons Digital Archive","TIFF file 8-bit","English (U.K.)","Documentary photograph",TWA00234.tif,,,,,,,,,,,,,,,,,,,,,,,,,,,,,,,,,,,,"Bridge,River,Tom Walker",https://penninehorizons.org/files/original/abfb5bcb7167a8ea999abe2f1014dabf.jpg,"Still Image","Tom Walker collection",1,0
24622,https://penninehorizons.org/items/show/24622,"Low Bridge, Luddenden - TWA00235","Luddenden, River, Tom Walker","LOW BRIDGE or Hebble Bridge at the head of the Luddenden Dean Valley,  near Castle Carr Lower Lodge, Saltenstall. It is a stone bridge of one arch. According to John Longbottom it was in former days “one of the most used ‘cross-country’ bridges for horsemen, vehicles, passengers, cattle-drovers, and pack-horses, in the West Riding.” In 1759 John Whitaker was paid 1/o “for mending Heble Bridg.” More extensive work was needed in 1769 since £2 10 0 was paid as a share in rebuilding the bridge together with 1/0 for “expenses (drinks).”","Tom Walker","Olwen Forest","Pennine Horizons Digital Archive","1960 , 1960s","Olwen Forest","PHDA - Tom Walker Collection","Pennine Horizons Digital Archive","TIFF file 8-bit","English (U.K.)","Documentary photograph",TWA00235.tif,,,,,,,,,,,,,,,,,,,,,,,,,,,,,,,,,,,,"Luddenden,River,Tom Walker",https://penninehorizons.org/files/original/482e0a3a98e1632680bb86e5fabb49a9.jpg,"Still Image","Tom Walker collection",1,0
24623,https://penninehorizons.org/items/show/24623,"Luddenden Bridge - TWA00236","Luddenden, River, Tom Walker","LUDDENDEN BRIDGE in Luddenden Village is mentioned in the will of Richard Stanclyffe of Halifax who in 1518 bequeathed “to the byldyng of Luddenden brige Xli (£10) if so be they take upon hand to bilde the brigge of stone.” This bridge and the preceding one appear on Christopher Saxton’s map of 1599 made in connection with the Wade and Foxcroft lawsuit. In the Bridges Book of 1752 it is recorded as repairable by “Luddenden Town.” A pole for repairing the bridge in 1769 cost 4 shillings.","Tom Walker","Olwen Forest","Pennine Horizons Digital Archive","1960 , 1960s","Olwen Forest","PHDA - Tom Walker Collection","Pennine Horizons Digital Archive","TIFF file 8-bit","English (U.K.)","Documentary photograph",TWA00236.tif,,,,,,,,,,,,,,,,,,,,,,,,,,,,,,,,,,,,"Luddenden,River,Tom Walker",https://penninehorizons.org/files/original/3f97febc69f73dea008cd4bcab880726.jpg,"Still Image","Tom Walker collection",1,0
24530,https://penninehorizons.org/items/show/24530,"Luddendenfoot - TWA00142","Luddendenfoot, River, Tom Walker","Luddendenfoot Bridge","Tom Walker","Olwen Forest","Pennine Horizons Digital Archive","1960 , 1960s","Olwen Forest","PHDA - Tom Walker Collection","Pennine Horizons Digital Archive","TIFF file 8-bit","English (U.K.)","Documentary photograph",TWA00142.tif,,,,,,,,,,,,,,,,,,,,,,,,,,,,,,,,,,,,"Luddendenfoot,River,Tom Walker",https://penninehorizons.org/files/original/5694b88660c6ba63ff59785432980104.jpg,"Still Image","Tom Walker collection",1,0
24535,https://penninehorizons.org/items/show/24535,"Luddendenfoot - TWA00147","Bridge, Canal, Canals, Luddendenfoot, Tom Walker, Transport","Bridge over Canal, Luddendenfoot","Tom Walker","Olwen Forest","Pennine Horizons Digital Archive","1960 , 1960s","Olwen Forest","PHDA - Tom Walker Collection","Pennine Horizons Digital Archive","TIFF file 8-bit","English (U.K.)","Documentary photograph",TWA00147.tif,,,,,,,,,,,,,,,,,,,,,,,,,,,,,,,,,,,,"Bridge,Canal,Luddendenfoot,Tom Walker,Transport",https://penninehorizons.org/files/original/0c459949ff2d444e2d6346f55bac5e32.jpg,"Still Image","Tom Walker collection",1,0
24624,https://penninehorizons.org/items/show/24624,"Luddendenfoot Bridge - TWA00237","Luddenden, River, River Calder, Tom Walker","LUDDENDEN FOOT BRIDGE was erected in 1882 by the Luddenden Foot board of Health to replace an earlier bridge washed away in the flood of December 23rd, 1880. This bridge, known as the “currie” bridge, was built between 1790 and 1795, Sowerby paying half the cost and Mr Currie, manufacturer at Boy Mill the other half. Luddenden Foot Bridge is shown on the 1599 map by Christopher Saxton, one of the earliest English map makers, already referred to under Boy Bridge. In 1711 at the Quarter Sessions at Halifax the West Riding granted £6 towards “Luddington” bridge. In 1823 the wing walls and battlements were to be repaired, in 1825 the bridge was to be widened and in 1869 a new causeway was to be laid. At the Wakefield Sessions in April, 1877 Mr Gamaliel Sutcliffe was authorised to build one portion of parapet walls and to maintain them.","Tom Walker","Olwen Forest","Pennine Horizons Digital Archive","1960 , 1960s","Olwen Forest","PHDA - Tom Walker Collection","Pennine Horizons Digital Archive","TIFF file 8-bit","English (U.K.)","Documentary photograph",TWA00237.tif,,,,,,,,,,,,,,,,,,,,,,,,,,,,,,,,,,,,"Luddenden,River,River Calder,Tom Walker",https://penninehorizons.org/files/original/41348e429ba1890753c8cd53552b3a4d.jpg,"Still Image","Tom Walker collection",1,0
24625,https://penninehorizons.org/items/show/24625,"Lum Bridge, Soyland - TWA00238","River, Soyland, Tom Walker","LUM BRIDGE is the bridge crossed on the way from the Alma Inn to Soyland. It is a single-arch stone bridge with the date 1866 carved on a stone above the arch on the Sowerby side. An earlier bridge was repaired for 1s 8d according to the accounts of the Sowerby Constable,  Sam’ll Haldeworth, dated Jan 3rd, 1736.","Tom Walker","Olwen Forest","Pennine Horizons Digital Archive","1960 , 1960s","Olwen Forest","PHDA - Tom Walker Collection","Pennine Horizons Digital Archive","TIFF file 8-bit","English (U.K.)","Documentary photograph",TWA00238.tif,,,,,,,,,,,,,,,,,,,,,,,,,,,,,,,,,,,,"River,Soyland,Tom Walker",https://penninehorizons.org/files/original/a91521c6f273551176aa60d63c387662.jpg,"Still Image","Tom Walker collection",1,0
24626,https://penninehorizons.org/items/show/24626,"Lumb Bridge, Crimsworth - TWA00239","Bridge, Crimsworth, Crimsworth Dean, Crimsworth Dene, Crimsworthdean, Footbridge, Places, River, Tom Walker","LUMB BRIDGE is the fine single-arch stone pack-horse bridge in Crimsworth Dean at Lumb Falls. W.B. Crump expressed his opinion that the bridge “can hardly be later than 17th century and is not earlier than the 16th"".","Tom Walker","Olwen Forest","Pennine Horizons Digital Archive","1960 , 1960s","Olwen Forest","PHDA - Tom Walker Collection","Pennine Horizons Digital Archive","TIFF file 8-bit","English (U.K.)","Documentary photograph",TWA00239.tif,,,,,,,,,,,,,,,,,,,,,,,,,,,,,,,,,,,,"Bridge,Crimsworth,Crimsworth Dean,Crimsworth Dene,Crimsworthdean,Footbridge,Places,River,Tom Walker",https://penninehorizons.org/files/original/ee239578c384478ac3f22b7bf558cf91.jpg,"Still Image","Tom Walker collection",1,0
24647,https://penninehorizons.org/items/show/24647,"M62 - TWA00260","Buildings, Construction, Crane, Cranes, M62, Street Names, Tom Walker","The start of the construction of the M62","Tom Walker","Olwen Forest","Pennine Horizons Digital Archive","1960 , 1960s","Olwen Forest","PHDA - Tom Walker Collection","Pennine Horizons Digital Archive","TIFF file 8-bit","English (U.K.)","Documentary photograph",TWA00260.tif,,,,,,,,,,,,,,,,,,,,,,,,,,,,,,,,,,,,"Buildings,Construction,Crane,Cranes,M62,Street Names,Tom Walker",https://penninehorizons.org/files/original/01d7229e3c2095369811cb7d7a8b3c84.jpg,"Still Image","Tom Walker collection",1,0
24627,https://penninehorizons.org/items/show/24627,"Marshaw Bridge, Cragg Vale - TWA00240","Bridge, Buildings, Cragg Vale, Places, Pubs Inns and Hotels, River, Tom Walker","MARSHAW BRIDGE is situated in Cragg Vale near St. John's in the Wilderness Church. It is a stone bridge of one arch. Its former name was Marschagh and the spelling has varied since then. In the Manor Court Rolls it is mentioned with ""the Baytinges"" as early as 1316. In 1655 the Sowerby Constable's Book contains payment for the repair of the ""highway leading to Marshawe Bridge from Snape."" In the Bridges Book it is listed as Marshey Bridge, repairable by Sowerby and Erringden.","Tom Walker","Olwen Forest","Pennine Horizons Digital Archive","1960 , 1960s","Olwen Forest","PHDA - Tom Walker Collection","Pennine Horizons Digital Archive","TIFF file 8-bit","English (U.K.)","Documentary photograph",TWA00240.tif,,,,,,,,,,,,,,,,,,,,,,,,,,,,,,,,,,,,"Bridge,Buildings,Cragg Vale,Places,Pubs Inns and Hotels,River,Tom Walker",https://penninehorizons.org/files/original/0bd8cb75c9c2449280e3308ddc54266f.jpg,"Still Image","Tom Walker collection",1,0
24628,https://penninehorizons.org/items/show/24628,"Mereclough Bridge, near Sowerby Bridge - TWA00241","Bridge, River, River Calder, Sowerby Bridge, Tom Walker","MEARCLOUGH BRIDGE is a double-arch stone bridge over the river Calder at the foot of Fall Lane. As far back as 1300 there was a corn mill here run by water, and for nearly 500 years this mill was owned by the Waterhouse family of Skircoat. Mearclough Bridge, originally spelled Meerclough, was repairable by Norland Township which appears to have been in continuous trouble over this bridge at the West Riding Quarter Sessions. In 1709 £10 was given to repair the bridge and in 1744 another £10. At Pontefract in April 1769 Norland was fined £100 which was respited, or delayed, for not keeping the bridge in repair. In 1773 the bridge was “In decay still” and Norland was fined £300 more, both fines to be estreated, or used, for repairs. Norland the “confessed themselves on record highly chargeable for the Repair of the said Bridge.” At Pontefract in April 1774, Norland having complied with Orders £250 was given as a gratuity towards “building same of stone.”","Tom Walker","Olwen Forest","Pennine Horizons Digital Archive","1960 , 1960s","Olwen Forest","PHDA - Tom Walker Collection","Pennine Horizons Digital Archive","TIFF file 8-bit","English (U.K.)","Documentary photograph",TWA00241.tif,,,,,,,,,,,,,,,,,,,,,,,,,,,,,,,,,,,,"Bridge,River,River Calder,Sowerby Bridge,Tom Walker",https://penninehorizons.org/files/original/085edb263310fe1265ecbce8b4c98724.jpg,"Still Image","Tom Walker collection",1,0
24577,https://penninehorizons.org/items/show/24577,"Mereclough Bridge, Sowerby Bridge - TWA00190","Bridge, River, Sowerby Bridge, Tom Walker",,"Tom Walker","Olwen Forest","Pennine Horizons Digital Archive","1960 , 1960s","Olwen Forest","PHDA - Tom Walker Collection","Pennine Horizons Digital Archive","TIFF file 8-bit","English (U.K.)","Documentary photograph",TWA00190.tif,,,,,,,,,,,,,,,,,,,,,,,,,,,,,,,,,,,,"Bridge,River,Sowerby Bridge,Tom Walker",https://penninehorizons.org/files/original/44ccb4435fe0ecea6a344271000c8228.jpg,"Still Image","Tom Walker collection",1,0
24629,https://penninehorizons.org/items/show/24629,"Milking Bridge, Colden Valley - TWA00242","Bridge, Colden Valley, Footbridge, Places, River, Tom Walker","MILKING BRIDGE is a very narrow stone footbridge of one arch in a dell at the lower end of the Colden Valley. According to W. B. Crump it was the subject of two drawings by J. Horner.","Tom Walker","Olwen Forest","Pennine Horizons Digital Archive","1960 , 1960s","Olwen Forest","PHDA - Tom Walker Collection","Pennine Horizons Digital Archive","TIFF file 8-bit","English (U.K.)","Documentary photograph",TWA00242.tif,,,,,,,,,,,,,,,,,,,,,,,,,,,,,,,,,,,,"Bridge,Colden Valley,Footbridge,Places,River,Tom Walker",https://penninehorizons.org/files/original/a949556982a6fe43246a6dff7bb44590.jpg,"Still Image","Tom Walker collection",1,0
24549,https://penninehorizons.org/items/show/24549,"Moorland Bridge - TWA00161","Bridge, Tom Walker, stream",,"Tom Walker","Olwen Forest","Pennine Horizons Digital Archive","1960 , 1960s","Olwen Forest","PHDA - Tom Walker Collection","Pennine Horizons Digital Archive","TIFF file 8-bit","English (U.K.)","Documentary photograph",TWA00161.tif,,,,,,,,,,,,,,,,,,,,,,,,,,,,,,,,,,,,"Bridge,stream,Tom Walker",https://penninehorizons.org/files/original/7ca607a533640da6e1a38f838a1e707b.jpg,"Still Image","Tom Walker collection",1,0
24630,https://penninehorizons.org/items/show/24630,"Mytholme Bridge, Halifax - TWA00243","Bridge, Halifax, Places, River, Shibden, Tom Walker","MYTHOLME BRIDGE takes Lister Road over the Red Beck in the Shibden Valley. It has one stone arch and an inscription on the north side of the bridge records ""This Bridge was Built and the Diversion of the Road made in the year 1809."" In the West Riding Quarter Sessions Records for April, 1822, at Pontefract, it is recorded that the battlements were to be repaired.","Tom Walker","Olwen Forest","Pennine Horizons Digital Archive","1960 , 1960s","Olwen Forest","PHDA - Tom Walker Collection","Pennine Horizons Digital Archive","TIFF file 8-bit","English (U.K.)","Documentary photograph",TWA00243.tif,,,,,,,,,,,,,,,,,,,,,,,,,,,,,,,,,,,,"Bridge,Halifax,Places,River,Shibden,Tom Walker",https://penninehorizons.org/files/original/d7feedc759304b7a163f7d15c94dec84.jpg,"Still Image","Tom Walker collection",1,0
24545,https://penninehorizons.org/items/show/24545,"Mytholmroyd - TWA00157","Mytholmroyd, Places, Railway, Railway Viaduct, Railways, Tom Walker","Thrush Hill Bridge at Caldene, Mytholmroyd","Tom Walker","Olwen Forest","Pennine Horizons Digital Archive","1960 , 1960s","Olwen Forest","PHDA - Tom Walker Collection","Pennine Horizons Digital Archive","TIFF file 8-bit","English (U.K.)","Documentary photograph",TWA00157.tif,,,,,,,,,,,,,,,,,,,,,,,,,,,,,,,,,,,,"Mytholmroyd,Places,Railway,Railway Viaduct,Railways,Tom Walker",https://penninehorizons.org/files/original/5d4491c407ef6446b07a01820074bc9e.jpg,"Still Image","Tom Walker collection",1,0
24541,https://penninehorizons.org/items/show/24541,"Mytholmroyd Viaduct and 'down' Platform. - TWA00153","Mytholmroyd, Places, Railway, Railway Viaduct, Railways, Station Platform, Tom Walker, Viaduct","The platforms not only extended along the viaducts but also extended over its sides it supported by the massive brackets seen here.","Tom Walker","Olwen Forest","Pennine Horizons Digital Archive","1960 , 1960s","Olwen Forest","PHDA - Tom Walker Collection","Pennine Horizons Digital Archive","TIFF file 8-bit","English (U.K.)","Documentary photograph",TWA00153.tif,,,,,,,,,,,,,,,,,,,,,,,,,,,,,,,,,,,,"Mytholmroyd,Places,Railway,Railway Viaduct,Railways,Station Platform,Tom Walker,Viaduct",https://penninehorizons.org/files/original/637b68dee539cb84476cd6fc7c3b3aad.jpg,"Still Image","Tom Walker collection",1,0
24544,https://penninehorizons.org/items/show/24544,"Mytholmroyd Viaduct and 'up' Platform. - TWA00156","Mytholmroyd, Places, Railway, Railway Viaduct, Railways, Station, Station Platform, Tom Walker, Viaduct","The platforms not only extended along the viaducts but also extended over its sides it supported by the massive brackets seen here.","Tom Walker","Olwen Forest","Pennine Horizons Digital Archive","1960 , 1960s","Olwen Forest","PHDA - Tom Walker Collection","Pennine Horizons Digital Archive","TIFF file 8-bit","English (U.K.)","Documentary photograph",TWA00156.tif,,,,,,,,,,,,,,,,,,,,,,,,,,,,,,,,,,,,"Mytholmroyd,Places,Railway,Railway Viaduct,Railways,Station,Station Platform,Tom Walker,Viaduct",https://penninehorizons.org/files/original/b06d15df30ed5b00c168dbb422e64807.jpg,"Still Image","Tom Walker collection",1,0
24490,https://penninehorizons.org/items/show/24490,"New Bridge, Cragg Vale - TWA00101","Bridge, Cragg Vale, River","New Bridge, Cragg Vale. c 1960","Tom Walker","Olwen Forest","Pennine Horizons Digital Archive","1960 , 1960s","Olwen Forest","PHDA - Tom Walker Collection","Pennine Horizons Digital Archive","TIFF file 8-bit","English (U.K.)","Documentary photograph",TWA00101.tif,,,,,,,,,,,,,,,,,,,,,,,,,,,,,,,,,,,,"Bridge,Cragg Vale,River",https://penninehorizons.org/files/original/35eeec4ad31d4339f15cfb461878c6a5.jpg,"Still Image","Tom Walker collection",1,0
24491,https://penninehorizons.org/items/show/24491,"New Bridge, Cragg Vale - TWA00102","Bridge, Cragg Vale, River","Date C 1960","Tom Walker","Olwen Forest","Pennine Horizons Digital Archive","1960 , 1960s","Olwen Forest","PHDA - Tom Walker Collection","Pennine Horizons Digital Archive","TIFF file 8-bit","English (U.K.)","Documentary photograph",TWA00102.tif,,,,,,,,,,,,,,,,,,,,,,,,,,,,,,,,,,,,"Bridge,Cragg Vale,River",https://penninehorizons.org/files/original/bd783478ee5f9ffeafe6e781bf817554.jpg,"Still Image","Tom Walker collection",1,0
24575,https://penninehorizons.org/items/show/24575,"New Bridge, Midgehole, Hardcastle Crags - TWA00188","Bridge, Feature, Forest, Hardcastle Crags, Landscape, Midgehole, Places, River, Tom Walker, Woodland, Woodlands, Woods",,"Tom Walker","Olwen Forest","Pennine Horizons Digital Archive","1960 , 1960s","Olwen Forest","PHDA - Tom Walker Collection","Pennine Horizons Digital Archive","TIFF file 8-bit","English (U.K.)","Documentary photograph",TWA00188.tif,,,,,,,,,,,,,,,,,,,,,,,,,,,,,,,,,,,,"Bridge,Feature,Forest,Hardcastle Crags,Landscape,Midgehole,Places,River,Tom Walker,Woodland,Woodlands,Woods",https://penninehorizons.org/files/original/03e9a110df4e0fa42faf033adcc87714.jpg,"Still Image","Tom Walker collection",1,0
24632,https://penninehorizons.org/items/show/24632,"New Bridge, Midgehole, Hardcastle Crags - TWA00245","Bridge, Hardcastle Crags, Midgehole, Places, River, Tom Walker","NEW BRIDGE spanning the Hebden near the entrance to Hardcastle Crags is a stone bridge of one arch built probably in the middle of the eighteenth century.","Tom Walker","Olwen Forest","Pennine Horizons Digital Archive","1960 , 1960s","Olwen Forest","PHDA - Tom Walker Collection","Pennine Horizons Digital Archive","TIFF file 8-bit","English (U.K.)","Documentary photograph",TWA00245.tif,,,,,,,,,,,,,,,,,,,,,,,,,,,,,,,,,,,,"Bridge,Hardcastle Crags,Midgehole,Places,River,Tom Walker",https://penninehorizons.org/files/original/8317c5cc9105013caa2a526b20edd297.jpg,"Still Image","Tom Walker collection",1,0
