﻿"Item Id","Item URI","Dublin Core:Title","Dublin Core:Subject","Dublin Core:Description","Dublin Core:Creator","Dublin Core:Source","Dublin Core:Publisher","Dublin Core:Date","Dublin Core:Contributor","Dublin Core:Rights","Dublin Core:Relation","Dublin Core:Format","Dublin Core:Language","Dublin Core:Type","Dublin Core:Identifier","Dublin Core:Coverage","Item Type Metadata:Lesson Plan Text","Item Type Metadata:Bibliography","Item Type Metadata:Biographical Text","Item Type Metadata:Occupation","Item Type Metadata:Death Date","Item Type Metadata:Birthplace","Item Type Metadata:Birth Date","Item Type Metadata:Participants","Item Type Metadata:Event Type","Item Type Metadata:URL","Item Type Metadata:Bit Rate/Frequency","Item Type Metadata:Interviewer","Item Type Metadata:Interviewee","Item Type Metadata:Location","Item Type Metadata:Transcription","Item Type Metadata:Local URL","Item Type Metadata:Original Format","Item Type Metadata:Physical Dimensions","Item Type Metadata:Duration","Item Type Metadata:Compression","Item Type Metadata:Producer","Item Type Metadata:Director","Item Type Metadata:Text","Item Type Metadata:Time Summary","Item Type Metadata:Email Body","Item Type Metadata:Subject Line","Item Type Metadata:From","Item Type Metadata:To","Item Type Metadata:CC","Item Type Metadata:BCC","Item Type Metadata:Number of Attachments","Item Type Metadata:Standards","Item Type Metadata:Objectives","Item Type Metadata:Materials",tags,file,itemType,collection,public,featured
20506,https://penninehorizons.org/items/show/20506,"St Michael's Church, Mytholmroyd. - WAO00109","Church, Mytholmroyd, Painting, Places, St Michael's Church, spire","Undated postcard showing an 1849 engraving of the church. The foundation stone was laid in 1847 and the church was consecrated in 1848. Enlarged in 1887, the following year the foundation stone was laid for a new chancel. Distinctively it has a small octagonal spire on top of the tower.",,"Pennine Horizons Digital Archive","Pennine Horizons Digital Archive","No date yet","Wayne Ogden","PHDA - Wayne Ogden Collection","Pennine Horizons Digital Archive","TIFF file 8-bit","English (U.K.)","Documentary photograph",WAO00109.tif,,,,,,,,,,,,,,,,,,,,,,,,,,,,,,,,,,,,"Church,Mytholmroyd,Painting,Places,Spire,St Michael's Church",https://penninehorizons.org/files/original/d5e0772210f8fabf5387ec324ce21e22.jpg,"Still Image","Wayne Ogden collection",1,0
20513,https://penninehorizons.org/items/show/20513,"St Michael's Church, Mytholmroyd. - WAO00116","Church, Mytholmroyd, People, Places, St Michael's Church, Sunday School.","Undated postcard. Taken outside St Michael's  Sunday School. A note on the reverse gives the Vicar as Thomas Metcalfe and John Willie Fielding centre front and on the right hand side Elsie Hargreaves.",,"Pennine Horizons Digital Archive","Pennine Horizons Digital Archive","No date yet","Wayne Ogden","PHDA - Wayne Ogden Collection","Pennine Horizons Digital Archive","TIFF file 8-bit","English (U.K.)","Documentary photograph",WAO00116.tif,,,,,,,,,,,,,,,,,,,,,,,,,,,,,,,,,,,,"Church,Mytholmroyd,People,Places,St Michael's Church,Sunday School.",https://penninehorizons.org/files/original/bf78550653852834fd7e73ac1bf24f35.jpg,"Still Image","Wayne Ogden collection",1,0
20514,https://penninehorizons.org/items/show/20514,"St Michael's Church, Mytholmroyd. - WAO00118","Church, Mytholmroyd, Places, River, River Calder, St Michael's Church","Undated postcard. Looking down the River Calder from Caldene Bridge. The roof of the Sunday school building over the bridge has since been lowered.",,"Pennine Horizons Digital Archive","Pennine Horizons Digital Archive","No date yet","Wayne Ogden","PHDA - Wayne Ogden Collection","Pennine Horizons Digital Archive","TIFF file 8-bit","English (U.K.)","Documentary photograph",WAO00118.tif,,,,,,,,,,,,,,,,,,,,,,,,,,,,,,,,,,,,"Church,Mytholmroyd,Places,River,River Calder,St Michael's Church",https://penninehorizons.org/files/original/ddcaf93554566548898814e01d1a43fd.jpg,"Still Image","Wayne Ogden collection",1,0
20652,https://penninehorizons.org/items/show/20652,"Station Bridge, Luddenden Foot - WAO00259","Bridge, Hand coloured, Luddenden Foot, Places, Postcard, River, River Calder, Water","Station Bridge, Luddenden Foot",,"Pennine Horizons Digital Archive","Pennine Horizons Digital Archive","No date yet","Wayne Ogden","PHDA - Wayne Ogden Collection","Pennine Horizons Digital Archive","TIFF file 8-bit","English (U.K.)","Documentary photograph",WAO00259.tif,,,,,,,,,,,,,,,,,,,,,,,,,,,,,,,,,,,,"#Bridge,Bridge,Hand coloured,Luddenden Foot,Places,Postcard,River,River Calder,Water",https://penninehorizons.org/files/original/3d1f67f6591e407041b77f2c3c3508db.jpg,"Still Image","Wayne Ogden collection",1,0
20645,https://penninehorizons.org/items/show/20645,"Station Road, Luddendenfoot. - WAO00252","Church, Churches & Chapels, Churches_&_Chapels, Cobbles, Luddenden Foot, Minster, Railway, Railways, Station Road, Terraced Houses, spire","Postcard date stamped May 1916. Looking down the road from the canal bridge; over the river, past the Goods Yard and then over  the railway and up to St Mary's Church. The church was built in 1873, closed in 1977 and its 126ft spire was demolished in 1980.","Lion Series E W. L. ","Pennine Horizons Digital Archive","Pennine Horizons Digital Archive",1910s,"Wayne Ogden","PHDA - Wayne Ogden Collection","Pennine Horizons Digital Archive","TIFF file 8-bit","English (U.K.)","Documentary photograph",WAO00252.tif,,,,,,,,,,,,,,,,,,,,,,,,,,,,,,,,,,,,"1910s,Church,Churches & Chapels,Churches_&_Chapels,Cobbles,Luddenden Foot,Minster,Railway,Railways,Spire,Station Road,Terraced Houses",https://penninehorizons.org/files/original/998e56adaff9895c22c4aa2199dbda7b.jpg,"Still Image","Wayne Ogden collection",1,0
20648,https://penninehorizons.org/items/show/20648,"Steam Train, Luddendenfoot, c.1925.  - WAO00255","Carriages, Luddenden Foot, Mill, Passenger Train, Railway, Steam Loco","Loco number 11279 taking up water on the troughs between Sowerby Tunnel and Luddendenfoot as it heads towards Sowerby Bridge. Water troughs such as these enabled steam engines to take on water without stopping.","Nostalgia Ink","Pennine Horizons Digital Archive","Pennine Horizons Digital Archive",1920s,"Wayne Ogden","PHDA - Wayne Ogden Collection","Pennine Horizons Digital Archive","TIFF file 8-bit","English (U.K.)","Documentary photograph",WAO00255.tif,,,,,,,,,,,,,,,,,,,,,,,,,,,,,,,,,,,,"Carriages,Luddenden Foot,Mill,Passenger Train,Railway,Railways,Steam loco",https://penninehorizons.org/files/original/e463b8e9b92280a17fe56751f49753e1.jpg,"Still Image","Wayne Ogden collection",1,0
20540,https://penninehorizons.org/items/show/20540,"Stepping Stones, Mytholmroyd. c1910 - WAO00144","Cows, Elphin Brook, Mytholmroyd, Places, River, Stepping Stones","Undated postcard but by the girls dress pre-First World War. The stepping stones were across Elphin Brook near the railway viaduct, behind the Shoulder of Mutton.",,"Pennine Horizons Digital Archive","Pennine Horizons Digital Archive","No date yet","Wayne Ogden","PHDA - Wayne Ogden Collection","Pennine Horizons Digital Archive","TIFF file 8-bit","English (U.K.)","Documentary photograph",WAO00144.tif,,,,,,,,,,,,,,,,,,,,,,,,,,,,,,,,,,,,"Cows,Elphin Brook,Mytholmroyd,Places,River,Stepping Stones",https://penninehorizons.org/files/original/cdfaa8fd7f29cd07ecce80a13ec9072b.jpg,"Still Image","Wayne Ogden collection",1,0
20549,https://penninehorizons.org/items/show/20549,"Syke's Mill, Brearley, Near. Luddendenfoot. - WAO00154","Brearley, Fire, Mills, Places, ruins","Postcard with May 1907 date stamp. Correctly called Brearley Mills it was occupied by Levi Sykes & Co (Brearley) Ltd, blanket manufacturers,  and was gutted by fire 30 April 1907.",,"Pennine Horizons Digital Archive","Pennine Horizons Digital Archive",1900s,"Wayne Ogden","PHDA - Wayne Ogden Collection","Pennine Horizons Digital Archive","TIFF file 8-bit","English (U.K.)","Documentary photograph",WAO00154.tif,,,,,,,,,,,,,,,,,,,,,,,,,,,,,,,,,,,,"Brearley,Fire,Mills,Places,Ruins",https://penninehorizons.org/files/original/00e7a46c147adbc2ed5886eadf19f251.jpg,"Still Image","Wayne Ogden collection",1,0
20642,https://penninehorizons.org/items/show/20642,"The Bridge, Station Road, Luddendenfoot. - WAO00249","Bridge, Chimneys, Luddenden Foot, Mill pool, People, Railway, Railways, River, River Calder, Rochdale Canal, Station Road, Terraced Houses","Postcard with September 1922 postmark. Looking up to the junction with Burnley Road with the bridge over the River Calder in the foreground and then the bridge over the Rochdale Canal further on.","Strand Series, W.H.S & S Hx","Pennine Horizons Digital Archive","Pennine Horizons Digital Archive",1920s,"Wayne Ogden","PHDA - Wayne Ogden Collection","Pennine Horizons Digital Archive","TIFF file 8-bit","English (U.K.)","Documentary photograph",WAO00249.tif,,,,,,,,,,,,,,,,,,,,,,,,,,,,,,,,,,,,"Bridge,Chimneys,Luddenden Foot,Mill pool,People,Railway,Railways,River,River Calder,Rochdale Canal,Station Road,Terraced Houses",https://penninehorizons.org/files/original/941ab6c4701f9b1c3c6924c59dfbbe80.jpg,"Still Image","Wayne Ogden collection",1,0
20659,https://penninehorizons.org/items/show/20659,"The Church of St Mary the Virgin, Luddenden Foot - WAO00266","Church, Churches & Chapels, Churches_&_Chapels, Luddenden Foot, Minster, St Mary's Church, spire, steeple","Built in Early Decorated style in 1873 at a cost of £7,000, four sisters bore the cost in memory of their parents. The tower contained one bell. It was demolished in the mid 1970s. On the left is the former Blackwood Hall School, now a private residence.",,"Pennine Horizons Digital Archive","Pennine Horizons Digital Archive","No date yet","Wayne Ogden","PHDA - Wayne Ogden Collection","Pennine Horizons Digital Archive","TIFF file 8-bit","English (U.K.)","Documentary photograph",WAO00266.tif,,,,,,,,,,,,,,,,,,,,,,,,,,,,,,,,,,,,"Churches & Chapels,Luddenden Foot,Spire,St Mary's Church",https://penninehorizons.org/files/original/12dd56f566184deaf619cd15e9f2fab9.jpg,"Still Image","Wayne Ogden collection",1,0
20660,https://penninehorizons.org/items/show/20660,"The Round House, Luddendenfoot  - WAO00267","House, Luddenden Foot","The round house was on the road down to Longbottom Mill at Cooperfields, now Tenterfield buisness park.",,"Pennine Horizons Digital Archive","Pennine Horizons Digital Archive","No date yet","Wayne Ogden","PHDA - Wayne Ogden Collection","Pennine Horizons Digital Archive","TIFF file 8-bit","English (U.K.)","Documentary photograph",WAO00267.tif,,,,,,,,,,,,,,,,,,,,,,,,,,,,,,,,,,,,"House,Luddenden Foot",https://penninehorizons.org/files/original/ad2476d162a30aa40cba96f3d7454472.jpg,"Still Image","Wayne Ogden collection",1,0
20637,https://penninehorizons.org/items/show/20637,"The Stream, Cragg Vale, Mytholmroyd. - WAO00244","Cragg Vale, Feature, Forest, Landscape, Mytholmroyd, Places, River, Woodland, Woodlands, Woods, stream","Postcard with 1931 postmark.","Lilywhite Ltd Triangle","Pennine Horizons Digital Archive","Pennine Horizons Digital Archive",1930s,"Wayne Ogden","PHDA - Wayne Ogden Collection","Pennine Horizons Digital Archive","TIFF file 8-bit","English (U.K.)","Documentary photograph",WAO00244.tif,,,,,,,,,,,,,,,,,,,,,,,,,,,,,,,,,,,,"Cragg Vale,Feature,Forest,Landscape,Mytholmroyd,Places,River,stream,Woodland,Woodlands,Woods",https://penninehorizons.org/files/original/61cff4e3e1d9cf773b05a2e75a938404.jpg,"Still Image","Wayne Ogden collection",1,0
20589,https://penninehorizons.org/items/show/20589,"Train Leaving Mytholmroyd Station  - WAO00196","Hell Hole Rocks, Mytholmroyd, Places, Railway, Railway station, Railways, Steam train",,,"Pennine Horizons Digital Archive","Pennine Horizons Digital Archive","No date yet","Wayne Ogden","PHDA - Wayne Ogden Collection","Pennine Horizons Digital Archive","TIFF file 8-bit","English (U.K.)","Documentary photograph",WAO00196.tif,,,,,,,,,,,,,,,,,,,,,,,,,,,,,,,,,,,,"Hell Hole Rocks,Mytholmroyd,Places,Railway,Railway station,Railways,Steam train",https://penninehorizons.org/files/original/4c316b8c4242f0121da7745bd975cbfc.jpg,"Still Image","Wayne Ogden collection",1,0
20593,https://penninehorizons.org/items/show/20593,"Train Leaving Mytholmroyd Station  - WAO00200","Scout Rocks, Mytholmroyd, Railway, Railway station, Steam train","On the left is the loop line used by slow trains so that faster trains could overtake them.",,"Pennine Horizons Digital Archive","Pennine Horizons Digital Archive","No date yet","Wayne Ogden","PHDA - Wayne Ogden Collection","Pennine Horizons Digital Archive","TIFF file 8-bit","English (U.K.)","Documentary photograph",WAO00200.tif,,,,,,,,,,,,,,,,,,,,,,,,,,,,,,,,,,,,"Mytholmroyd,Railway,Railway station,Steam train",https://penninehorizons.org/files/original/2e2086951d8fa0b38fc025ca2c7ccd54.jpg,"Still Image","Wayne Ogden collection",1,0
20602,https://penninehorizons.org/items/show/20602,"Trestle Bridge, Blake Dean, Near. Hebden Bridge. - WAO00209","Blakedean, Hebden Bridge, Places, Railway, Railways, Trestle Bridge, Viaduct, Walshaw Dean Reservoir","Undated postcard. The bridge was built to carry a tramway from Whitehill Nook, Heptonstall, to transport materials and navvies to the construction site of Walshaw Dean Reservoirs. The bridge was 700ft long and 105ft above the valley floor. The bridge was demolished in 1912 but the stumps of the foundations still remain.","Valentines Series","Pennine Horizons Digital Archive","Pennine Horizons Digital Archive",1910s,"Wayne Ogden","PHDA - Wayne Ogden Collection","Pennine Horizons Digital Archive","TIFF file 8-bit","English (U.K.)","Documentary photograph",WAO00209.tif,,,,,,,,,,,,,,,,,,,,,,,,,,,,,,,,,,,,"1910s,Blakedean,Hebden Bridge,Places,Railway,Railways,Trestle Bridge,Viaduct,Walshaw Dean Reservoir",https://penninehorizons.org/files/original/a22c999f3f9190b4e045356e21195637.jpg,"Still Image","Wayne Ogden collection",1,0
20575,https://penninehorizons.org/items/show/20575,"Tythe Barn, Mayroyd, Hebden Bridge, c. 1909. - WAO00182","Hebden Bridge, Horse, Mayroyd, Mayroyd Hall, Telegraph Pole, Tram Lines, Tythe Barn, horse and trap","The gentleman with the horse is George William Thomas, son of James Farrar Thomas. The building on the right was the Tythe Barn. It became a pub and restaurant of that name, later changed to The Thirsty Turtle, now a private house. Behind it is Mayroyd Hall, and in the distance on the left is Mayroyd Mill.

Information supplied by Glen Thomas of Inverness.",,"Pennine Horizons Digital Archive","Pennine Horizons Digital Archive",1900s,"Wayne Ogden","PHDA - Wayne Ogden Collection","Pennine Horizons Digital Archive","TIFF file 8-bit","English (U.K.)","Documentary photograph",WAO00182.tif,,,,,,,,,,,,,,,,,,,,,,,,,,,,,,,,,,,,"Hebden Bridge,Horse,horse and trap,Mayroyd,Mayroyd Hall,Telegraph Pole,Tram Lines,Tythe Barn",https://penninehorizons.org/files/original/804947ad76c8907d3152bba4ae496079.jpg,"Still Image","Wayne Ogden collection",1,0
20553,https://penninehorizons.org/items/show/20553,"Unknown Couple Outside House. - WAO00158","Couple, Family, Mullion Window, Mytholmroyd, People, Places, Railings, cottage","Early 20th century postcard pre-1910, posted in Mytholmroyd. It was sent  by a Mr & Mrs Hargreaves of 23 Hall Gate, Mytholmroyd. Is this them? Sending family postcards was quite common at the time.",,"Pennine Horizons Digital Archive","Pennine Horizons Digital Archive",1910s,"Wayne Ogden","PHDA - Wayne Ogden Collection","Pennine Horizons Digital Archive","TIFF file 8-bit","English (U.K.)","Documentary photograph",WAO00158.tif,,,,,,,,,,,,,,,,,,,,,,,,,,,,,,,,,,,,"1910s,cottage,Couple,Family,Mullion Window,Mytholmroyd,People,Places,Railings",https://penninehorizons.org/files/original/ca39bea17d0c94e62815fcacc3eda6c8.jpg,"Still Image","Wayne Ogden collection",1,0
20621,https://penninehorizons.org/items/show/20621,"Vicarage and Lodge, Cragg Vale, Mytholmroyd. - WAO00228","Buildings, Church, Churches & Chapels, Churches_&_Chapels, Cragg Hall, Cragg Vale, Lodge, Minster, Mytholmroyd, Places, Vicarage","The lodge, at the entrance to New Cragg Hall. The hall was enlarged in 1904 by Helen and William Simpson-Hinchliffe, but destroyed by fire in 1921. The lodge is shown here with its original archway. This archway was later widened by them to allow motor vehicles to pass through. The Vicarage and Lodge are still standing.","F Walton, Cragg Vale ","Pennine Horizons Digital Archive","Pennine Horizons Digital Archive","No date yet","Wayne Ogden","PHDA - Wayne Ogden Collection","Pennine Horizons Digital Archive","TIFF file 8-bit","English (U.K.)","Documentary photograph",WAO00228.tif,,,,,,,,,,,,,,,,,,,,,,,,,,,,,,,,,,,,"Buildings,Church,Churches & Chapels,Churches_&_Chapels,Cragg Hall,Cragg Vale,Lodge,Minster,Mytholmroyd,Places,Vicarage",https://penninehorizons.org/files/original/4bd8e1b4da3f86bd5220a6513e0476fa.jpg,"Still Image","Wayne Ogden collection",1,0
20654,https://penninehorizons.org/items/show/20654,"View from Stocks Lane, Warley - WAO00261","Places, Warley, view",,,"Pennine Horizons Digital Archive","Pennine Horizons Digital Archive","No date yet","Wayne Ogden","PHDA - Wayne Ogden Collection","Pennine Horizons Digital Archive","TIFF file 8-bit","English (U.K.)","Documentary photograph",WAO00261.tif,,,,,,,,,,,,,,,,,,,,,,,,,,,,,,,,,,,,"Places,View,Warley",https://penninehorizons.org/files/original/97a31402c148c023f6f5141011ee6f25.jpg,"Still Image","Wayne Ogden collection",1,0
20609,https://penninehorizons.org/items/show/20609,"View over Hebden Bridge - WAO00216","Buildings, Calder Mill, Dodnaze, Hebden Bridge, Houses, Mill, Mill Chimney, Mills, Mount Skip, Places","Undated postcard. Centre of photo is the Dodnaze Estate with steel fabricated houses built in 1947 fronting onto Wadsworth Lane. In the centre is Calder Mill with its landmark chimney; the mill was gutted by fire November 1964.","Lilywhite Ltd, Brighouse","Pennine Horizons Digital Archive","Pennine Horizons Digital Archive",1940s,"Wayne Ogden","PHDA - Wayne Ogden Collection","Pennine Horizons Digital Archive","TIFF file 8-bit","English (U.K.)","Documentary photograph",WAO00216.tif,,,,,,,,,,,,,,,,,,,,,,,,,,,,,,,,,,,,"Buildings,Calder Mill,Dodnaze,Hebden Bridge,Houses,Mill,Mill chimney,Mills,Mount Skip,Places",https://penninehorizons.org/files/original/2de1e360fb2e088fd5cd018c35046741.jpg,"Still Image","Wayne Ogden collection",1,0
20636,https://penninehorizons.org/items/show/20636,"Views of Cragg Vale, Mytholmroyd. - WAO00243","Cragg Vale, Mytholmroyd, Places","Undated postcard.  St John in the Wilderness; Cragg Hall Lodge; The Falls; The Vicarage; Cragg Vale and Victoria Mill.","Lilywhite Ltd Triangle","Pennine Horizons Digital Archive","Pennine Horizons Digital Archive","No date yet","Wayne Ogden","PHDA - Wayne Ogden Collection","Pennine Horizons Digital Archive","TIFF file 8-bit","English (U.K.)","Documentary photograph",WAO00243.tif,,,,,,,,,,,,,,,,,,,,,,,,,,,,,,,,,,,,"Cragg Vale,Mytholmroyd,Places",https://penninehorizons.org/files/original/7b72fbcf628ff4070ab74f296cbf37b8.jpg,"Still Image","Wayne Ogden collection",1,0
20658,https://penninehorizons.org/items/show/20658,"Wainhouse Tower, Halifax - WAO00265","Halifax, King Cross, Wainhouse Tower",,,"Pennine Horizons Digital Archive","Pennine Horizons Digital Archive","No date yet","Wayne Ogden","PHDA - Wayne Ogden Collection","Pennine Horizons Digital Archive","TIFF file 8-bit","English (U.K.)","Documentary photograph",WAO00265.tif,,,,,,,,,,,,,,,,,,,,,,,,,,,,,,,,,,,,"Halifax,King Cross,Wainhouse Tower",https://penninehorizons.org/files/original/2a0145518bdbce8fa678362293ca9699.jpg,"Still Image","Wayne Ogden collection",1,0
20661,https://penninehorizons.org/items/show/20661,"Wainhouse Tower, Halifax - WAO00268","Halifax, King Cross, Wainhouse Tower",,,"Pennine Horizons Digital Archive","Pennine Horizons Digital Archive","No date yet","Wayne Ogden","PHDA - Wayne Ogden Collection","Pennine Horizons Digital Archive","TIFF file 8-bit","English (U.K.)","Documentary photograph",WAO00268.tif,,,,,,,,,,,,,,,,,,,,,,,,,,,,,,,,,,,,"Halifax,King Cross,Wainhouse Tower",https://penninehorizons.org/files/original/c54ea897ef9e1baab2161810076de4a6.jpg,"Still Image","Wayne Ogden collection",1,0
20671,https://penninehorizons.org/items/show/20671,"Walkers at Widdop - WAO00278","Group, Packhorse Inn, People, Widdop, walkers","This group of walkers outside the Packhorse Inn on the Widdop Road, which includes Ann and Wayne Ogden on the left, ready to set off. Are they fundraising for the Moorland Rescue?",,"Pennine Horizons Digital Archive","Pennine Horizons Digital Archive","No date yet","Wayne Ogden","PHDA - Wayne Ogden Collection","Pennine Horizons Digital Archive","TIFF file 8-bit","English (U.K.)","Documentary photograph",WAO00278.tif,,,,,,,,,,,,,,,,,,,,,,,,,,,,,,,,,,,,"Group,Packhorse Inn,People,walkers,Widdop",https://penninehorizons.org/files/original/f1753215978e78d0f5d82cfade8a5578.jpg,"Still Image","Wayne Ogden collection",1,0
20650,https://penninehorizons.org/items/show/20650,"War Memorial at Luddenden Foot - WAO00257","Luddenden Foot, WW1, War memorial","WW1 War Memorial at Luddenden Foot",,"Pennine Horizons Digital Archive","Pennine Horizons Digital Archive","No date yet","Wayne Ogden","PHDA - Wayne Ogden Collection","Pennine Horizons Digital Archive","TIFF file 8-bit","English (U.K.)","Documentary photograph",WAO00257.tif,,,,,,,,,,,,,,,,,,,,,,,,,,,,,,,,,,,,"#War Memorial,Luddenden Foot,War memorial,WW1",https://penninehorizons.org/files/original/eee0cad43a7de85895e90e64420b7e1c.jpg,"Still Image","Wayne Ogden collection",1,0
