﻿"Item Id","Item URI","Dublin Core:Title","Dublin Core:Subject","Dublin Core:Description","Dublin Core:Creator","Dublin Core:Source","Dublin Core:Publisher","Dublin Core:Date","Dublin Core:Contributor","Dublin Core:Rights","Dublin Core:Relation","Dublin Core:Format","Dublin Core:Language","Dublin Core:Type","Dublin Core:Identifier","Dublin Core:Coverage","Item Type Metadata:Lesson Plan Text","Item Type Metadata:Bibliography","Item Type Metadata:Biographical Text","Item Type Metadata:Occupation","Item Type Metadata:Death Date","Item Type Metadata:Birthplace","Item Type Metadata:Birth Date","Item Type Metadata:Participants","Item Type Metadata:Event Type","Item Type Metadata:URL","Item Type Metadata:Bit Rate/Frequency","Item Type Metadata:Interviewer","Item Type Metadata:Interviewee","Item Type Metadata:Location","Item Type Metadata:Transcription","Item Type Metadata:Local URL","Item Type Metadata:Original Format","Item Type Metadata:Physical Dimensions","Item Type Metadata:Duration","Item Type Metadata:Compression","Item Type Metadata:Producer","Item Type Metadata:Director","Item Type Metadata:Text","Item Type Metadata:Time Summary","Item Type Metadata:Email Body","Item Type Metadata:Subject Line","Item Type Metadata:From","Item Type Metadata:To","Item Type Metadata:CC","Item Type Metadata:BCC","Item Type Metadata:Number of Attachments","Item Type Metadata:Standards","Item Type Metadata:Objectives","Item Type Metadata:Materials",tags,file,itemType,collection,public,featured
23154,https://penninehorizons.org/items/show/23154,"Calder high School Theatre, Mytholmroyd. - DEF00236","Calder High School, Mytholmroyd, Places, School, Theatre","When the school had openrd in 1950 it was the first comprehensive in the West Riding.","Alan Greenwood","Pennine Horizons Digital Archive","Pennine Horizons Digital Archive","No date yet","David Fletcher","PHDA - David Fletcher Collection","Pennine Horizons Digital Archive","TIFF file 8-bit","English (U.K.)","Documentary photograph",DEF00236.tif,,,,,,,,,,,,,,,,,,,,,,,,,,,,,,,,,,,,"Calder High School,Mytholmroyd,Places,School,Theatre",https://penninehorizons.org/files/original/3ab8d168ea3b4ef178d1aab74acf6bfb.jpg,"Still Image","David Fletcher collection",1,0
13050,https://penninehorizons.org/items/show/13050,"On Stage - ALC00191","Costume, Entertainment, Group, People, Theatre","Is this in a theatre or a church hall?","Crossley Westerman","Pennine Horizons Digital Archive","Pennine Horizons Digital Archive","No date yet",,"PHDA - Alice Longstaff Collection","Pennine Horizons Digital Archive","TIFF file 8-bit","English (U.K.)","Documentary photograph",ALC00191.tif,,,,,,,,,,,,,,,,,,,,,,,,,,,,,,,,,,,,"Costume,Entertainment,Group,People,Theatre",https://penninehorizons.org/files/original/ce0d65ac9d71104b9d5b489cb1b7a2b1.jpg,"Still Image","Alice Longstaff - Group portraits",1,0
6678,https://penninehorizons.org/items/show/6678,"Halifax Playhouse - HLS01398","Architecture, Drawing, Halifax, Places, Sketch, Theatre, playhouse","PH16. 1979 Halifax Calendar.  Previously the Hanover Chapel it is now used by the Halifax Thespians.","Sarah Kay Tomlinson",,,"No date yet",,"PHDA - Hebden Bridge Local History Society","Pennine Horizons Digital Archive","TIFF file 8-bit","English (U.K.)","Documentary photograph",HLS01398.tif,,,,,,,,,,,,,,,,,,,,,,,,,,,,,,,,,,,,"Architecture,Drawing,Halifax,playhouse,Sketch,Theatre",https://penninehorizons.org/files/original/93ca4c1e429079656f26e2916185743c.jpg,"Still Image","Hebden Bridge Local History Society",1,0
9499,https://penninehorizons.org/items/show/9499,"The Little Theatre, Hebden Bridge - LLG00270","Buildings, Canal, Canals, Construction, Hebden Bridge, Places, Public Houses, Pubs Inns & Hotels, Taverns, Theatre, Trades Club, Transport, Workshop","The new building is under construction at the same time as the old building is being demolished. The red brick building is the Trades Club on Holme Street.",,"Pennine Horizons Digital Archive","Pennine Horizons Digital Archive","No date yet","Lloyd Greenwood","PHDA - Lloyd Greenwood Collection","Pennine Horizons Digital Archive","TIFF file 8-bit","English (U.K.)","Documentary photograph",LLG00270.tif,,,,,,,,,,,,,,,,,,,,,,,,,,,,,,,,,,,,"Buildings,Canal,Construction,Hebden Bridge,Public Houses,Pubs Inns and Hotels,Taverns,Theatre,Trades Club,Transport,Workshop",https://penninehorizons.org/files/original/a954ccef302731bebf9d2cc4a2d40acd.jpg,"Still Image","Lloyd Greenwood collection",1,0
9607,https://penninehorizons.org/items/show/9607,"Scene from Breath of Spring, 1960 - LLG00378","Event, Events, Gladys Thornber, Ilkley Players?, People, Ronnie Riches, Stage play, Theatre, Wilfred Brown","On back of the picture it says: Wilfred Brown, Ronnie Riches, Gladys Thornber. Ilkley Players?",,"Pennine Horizons Digital Archive","Pennine Horizons Digital Archive",1960s,"Lloyd Greenwood","PHDA - Lloyd Greenwood Collection","Pennine Horizons Digital Archive","TIFF file 8-bit","English (U.K.)","Documentary photograph",LLG00378.TIF,,,,,,,,,,,,,,,,,,,,,,,,,,,,,,,,,,,,"1960s,Event,Events,Gladys Thornber,Ilkley Players?,People,Ronnie Riches,Stage play,Theatre,Wilfred Brown",https://penninehorizons.org/files/original/e5bb7a0ee8f1c4856f9a29f84093596a.jpg,"Still Image","Lloyd Greenwood collection",1,0
9609,https://penninehorizons.org/items/show/9609,"A Breath of Spring - LLG00380","Gladys Thornber, Group, Ilkley Players?, Jean Shaw, Nora Dodds, People, Phyliss Boulton, Theatre, Wilfred Brown","Little Theatre Production. Nora Dodds, Gladys Thornber, Wilfred Brown, Stand-in from Ilkley Players, Phyliss Boulton",,"Pennine Horizons Digital Archive","Pennine Horizons Digital Archive","No date yet","Lloyd Greenwood","PHDA - Lloyd Greenwood Collection","Pennine Horizons Digital Archive","TIFF file 8-bit","English (U.K.)","Documentary photograph",LLG00380.TIF,,,,,,,,,,,,,,,,,,,,,,,,,,,,,,,,,,,,"Gladys Thornber,Group,Ilkley Players?,Jean Shaw,Nora Dodds,People,Phyliss Boulton,Theatre,Wilfred Brown",https://penninehorizons.org/files/original/bf47db441c943b70c447ebccbf4e7c42.jpg,"Still Image","Lloyd Greenwood collection",1,0
9611,https://penninehorizons.org/items/show/9611,"Unknown Women in play - LLG00382","Nurse, Sitting room, Stage play, Theatre",,,"Pennine Horizons Digital Archive","Pennine Horizons Digital Archive","No date yet","Lloyd Greenwood","PHDA - Lloyd Greenwood Collection","Pennine Horizons Digital Archive","TIFF file 8-bit","English (U.K.)","Documentary photograph",LLG00382.TIF,,,,,,,,,,,,,,,,,,,,,,,,,,,,,,,,,,,,"Nurse,Sitting room,Stage play,Theatre",https://penninehorizons.org/files/original/328a61875d1696e839ff6cd7871bee60.jpg,"Still Image","Lloyd Greenwood collection",1,0
9612,https://penninehorizons.org/items/show/9612," - LLG00383","Stage play, Theatre, Unknown players",,,"Pennine Horizons Digital Archive","Pennine Horizons Digital Archive","No date yet","Lloyd Greenwood","PHDA - Lloyd Greenwood Collection","Pennine Horizons Digital Archive","TIFF file 8-bit","English (U.K.)","Documentary photograph",LLG00383.TIF,,,,,,,,,,,,,,,,,,,,,,,,,,,,,,,,,,,,"Stage play,Theatre,Unknown players",https://penninehorizons.org/files/original/c7c93e4b4eb5d348a7e5ec33a89a83aa.jpg,"Still Image","Lloyd Greenwood collection",1,0
9613,https://penninehorizons.org/items/show/9613,"7 unknown actors in play - LLG00384","Evening dress, Sitting room, Stage play, Theatre, Unknown players",,,"Pennine Horizons Digital Archive","Pennine Horizons Digital Archive","No date yet","Lloyd Greenwood","PHDA - Lloyd Greenwood Collection","Pennine Horizons Digital Archive","TIFF file 8-bit","English (U.K.)","Documentary photograph",LLG00384.tif,,,,,,,,,,,,,,,,,,,,,,,,,,,,,,,,,,,,"Evening dress,Sitting room,Stage play,Theatre,Unknown players",https://penninehorizons.org/files/original/64a9969ebcfaecd325424787bceb0b1e.jpg,"Still Image","Lloyd Greenwood collection",1,0
9614,https://penninehorizons.org/items/show/9614,"Hebden Bridge Little Theatre, c 1950. - LLG00385","Elizabethan costumes, Hebden Bridge, Little Theatre, Places, Stage play, Sword, Theatre","""Tudor Wench"" a Little Theatre production. Lloyd Greenwood is third from left.",,"Pennine Horizons Digital Archive","Pennine Horizons Digital Archive",1950s,"Lloyd Greenwood","PHDA - Lloyd Greenwood Collection","Pennine Horizons Digital Archive","TIFF file 8-bit","English (U.K.)","Documentary photograph",LLG00385.tif,,,,,,,,,,,,,,,,,,,,,,,,,,,,,,,,,,,,"1950s,Elizabethan costumes,Hebden Bridge,Little Theatre,Stage play,Sword,Theatre",https://penninehorizons.org/files/original/08af2fea8a6b1ded1b1841529014fb02.jpg,"Still Image","Lloyd Greenwood collection",1,0
9615,https://penninehorizons.org/items/show/9615,"Scene from a Stage Play - LLG00386","Sitting room, Stage play, Theatre",,,"Pennine Horizons Digital Archive","Pennine Horizons Digital Archive","No date yet","Lloyd Greenwood","PHDA - Lloyd Greenwood Collection","Pennine Horizons Digital Archive","TIFF file 8-bit","English (U.K.)","Documentary photograph",LLG00386.tif,,,,,,,,,,,,,,,,,,,,,,,,,,,,,,,,,,,,"Sitting room,Stage play,Theatre",https://penninehorizons.org/files/original/2aaabdb43d6f7e8858d3565bad8c57e3.jpg,"Still Image","Lloyd Greenwood collection",1,0
9616,https://penninehorizons.org/items/show/9616,"Unknown Stage Play with 4 actors - LLG00387","Sitting room, Stage play, Theatre",,,"Pennine Horizons Digital Archive","Pennine Horizons Digital Archive","No date yet","Lloyd Greenwood","PHDA - Lloyd Greenwood Collection","Pennine Horizons Digital Archive","TIFF file 8-bit","English (U.K.)","Documentary photograph",LLG00387.tif,,,,,,,,,,,,,,,,,,,,,,,,,,,,,,,,,,,,"Sitting room,Stage play,Theatre",https://penninehorizons.org/files/original/a1bb92e8e1430e9fead69af80be1ad8d.jpg,"Still Image","Lloyd Greenwood collection",1,0
9617,https://penninehorizons.org/items/show/9617,"Unknown Stage Play with 3 actors - LLG00388","Edwardian dress, Sitting room, Stage play, Theatre",,,"Pennine Horizons Digital Archive","Pennine Horizons Digital Archive","No date yet","Lloyd Greenwood","PHDA - Lloyd Greenwood Collection","Pennine Horizons Digital Archive","TIFF file 8-bit","English (U.K.)","Documentary photograph",LLG00388.tif,,,,,,,,,,,,,,,,,,,,,,,,,,,,,,,,,,,,"Edwardian dress,Sitting room,Stage play,Theatre",https://penninehorizons.org/files/original/dced59717ef417b39b42cb46bbe7b779.jpg,"Still Image","Lloyd Greenwood collection",1,0
9618,https://penninehorizons.org/items/show/9618,"Unknown Stage Play with 3 actors - LLG00389","Georgian period costume, Stage play, Theatre",,,"Pennine Horizons Digital Archive","Pennine Horizons Digital Archive","No date yet","Lloyd Greenwood","PHDA - Lloyd Greenwood Collection","Pennine Horizons Digital Archive","TIFF file 8-bit","English (U.K.)","Documentary photograph",LLG00389.tif,,,,,,,,,,,,,,,,,,,,,,,,,,,,,,,,,,,,"Georgian period costume,Stage play,Theatre",https://penninehorizons.org/files/original/d282decb9f4c13ec920ab96df7f14910.jpg,"Still Image","Lloyd Greenwood collection",1,0
9619,https://penninehorizons.org/items/show/9619,"Unknown Stage Play with 3 actors - LLG00390","Event, Events, Stage play, Theatre","Possibly 1950s",,"Pennine Horizons Digital Archive","Pennine Horizons Digital Archive",1950s,"Lloyd Greenwood","PHDA - Lloyd Greenwood Collection","Pennine Horizons Digital Archive","TIFF file 8-bit","English (U.K.)","Documentary photograph",LLG00390.tif,,,,,,,,,,,,,,,,,,,,,,,,,,,,,,,,,,,,"Event,Events,Stage play,Theatre",https://penninehorizons.org/files/original/6bba9b3c8ea60ebc0e15c8ea24143e57.jpg,"Still Image","Lloyd Greenwood collection",1,0
9620,https://penninehorizons.org/items/show/9620,"Unknown Stage Play - LLG00391","Sitting room, Stage set, Theatre",,,"Pennine Horizons Digital Archive","Pennine Horizons Digital Archive","No date yet","Lloyd Greenwood","PHDA - Lloyd Greenwood Collection","Pennine Horizons Digital Archive","TIFF file 8-bit","English (U.K.)","Documentary photograph",LLG00391.tif,,,,,,,,,,,,,,,,,,,,,,,,,,,,,,,,,,,,"Sitting room,Stage set,Theatre",https://penninehorizons.org/files/original/016cd4ee5d20a43e76075d1c2a997205.jpg,"Still Image","Lloyd Greenwood collection",1,0
9621,https://penninehorizons.org/items/show/9621,"Unknown Stage Play with 5 actors - LLG00392","Sitting room, Stage play, Theatre","Lloyd Greenwood centre.",,"Pennine Horizons Digital Archive","Pennine Horizons Digital Archive","No date yet","Lloyd Greenwood","PHDA - Lloyd Greenwood Collection","Pennine Horizons Digital Archive","TIFF file 8-bit","English (U.K.)","Documentary photograph",LLG00392.tif,,,,,,,,,,,,,,,,,,,,,,,,,,,,,,,,,,,,"Sitting room,Stage play,Theatre",https://penninehorizons.org/files/original/43a7aa69959ef27c5351736f286d1e09.jpg,"Still Image","Lloyd Greenwood collection",1,0
9622,https://penninehorizons.org/items/show/9622,"Set for unknown Stage Play - LLG00393","Musical Instrument, Sitting room, Stage set, Theatre",,,"Pennine Horizons Digital Archive","Pennine Horizons Digital Archive","No date yet","Lloyd Greenwood","PHDA - Lloyd Greenwood Collection","Pennine Horizons Digital Archive","TIFF file 8-bit","English (U.K.)","Documentary photograph",LLG00393.tif,,,,,,,,,,,,,,,,,,,,,,,,,,,,,,,,,,,,"Musical Instrument,Sitting room,Stage set,Theatre",https://penninehorizons.org/files/original/68f93181b5ac7cc54171f6240b574a44.jpg,"Still Image","Lloyd Greenwood collection",1,0
9623,https://penninehorizons.org/items/show/9623,"Unknown Stage Play with 5 actors - LLG00394","Roman costumes, Stage play, Theatre","Lloyd Greenwood 2nd from left.",,"Pennine Horizons Digital Archive","Pennine Horizons Digital Archive","No date yet","Lloyd Greenwood","PHDA - Lloyd Greenwood Collection","Pennine Horizons Digital Archive","TIFF file 8-bit","English (U.K.)","Documentary photograph",LLG00394.tif,,,,,,,,,,,,,,,,,,,,,,,,,,,,,,,,,,,,"Roman costumes,Stage play,Theatre",https://penninehorizons.org/files/original/2bb02c48e0b3b5833cf1b22ea2766e7c.jpg,"Still Image","Lloyd Greenwood collection",1,0
9624,https://penninehorizons.org/items/show/9624,"Set for unknown Stage Play - LLG00395",Theatre,"Possibly the 1950s",,"Pennine Horizons Digital Archive","Pennine Horizons Digital Archive",1950s,"Lloyd Greenwood","PHDA - Lloyd Greenwood Collection","Pennine Horizons Digital Archive","TIFF file 8-bit","English (U.K.)","Documentary photograph",LLG00395.tif,,,,,,,,,,,,,,,,,,,,,,,,,,,,,,,,,,,,Theatre,https://penninehorizons.org/files/original/eee0674d6ae3303b742b9df2cd32a9a7.jpg,"Still Image","Lloyd Greenwood collection",1,0
9625,https://penninehorizons.org/items/show/9625,"Unknown Stage Play with 3 actors - LLG00396","Office, Stage play, Theatre","Lloyd Greenwood seated.",,"Pennine Horizons Digital Archive","Pennine Horizons Digital Archive","No date yet","Lloyd Greenwood","PHDA - Lloyd Greenwood Collection","Pennine Horizons Digital Archive","TIFF file 8-bit","English (U.K.)","Documentary photograph",LLG00396.tif,,,,,,,,,,,,,,,,,,,,,,,,,,,,,,,,,,,,"Office,Stage play,Theatre",https://penninehorizons.org/files/original/84c37f660a9e5a0218f3ff86ec035ba8.jpg,"Still Image","Lloyd Greenwood collection",1,0
9626,https://penninehorizons.org/items/show/9626,"Unknown Stage Play with 3 actors - LLG00397","Stage play, Theatre",,,"Pennine Horizons Digital Archive","Pennine Horizons Digital Archive","No date yet","Lloyd Greenwood","PHDA - Lloyd Greenwood Collection","Pennine Horizons Digital Archive","TIFF file 8-bit","English (U.K.)","Documentary photograph",LLG00397.tif,,,,,,,,,,,,,,,,,,,,,,,,,,,,,,,,,,,,"Stage play,Theatre",https://penninehorizons.org/files/original/0533af31866c614195964a944b639912.jpg,"Still Image","Lloyd Greenwood collection",1,0
9627,https://penninehorizons.org/items/show/9627,"Unknown Stage Play with 3 actors - LLG00398","Stage play, Theatre",,,"Pennine Horizons Digital Archive","Pennine Horizons Digital Archive","No date yet","Lloyd Greenwood","PHDA - Lloyd Greenwood Collection","Pennine Horizons Digital Archive","TIFF file 8-bit","English (U.K.)","Documentary photograph",LLG00398.tif,,,,,,,,,,,,,,,,,,,,,,,,,,,,,,,,,,,,"Stage play,Theatre",https://penninehorizons.org/files/original/a3ce62f62d5fd160d7d702b5ab21ce54.jpg,"Still Image","Lloyd Greenwood collection",1,0
9628,https://penninehorizons.org/items/show/9628,"Unknown Stage Play with 7 actors - LLG00399","Edwardian dress?, Stage play, Theatre",,,"Pennine Horizons Digital Archive","Pennine Horizons Digital Archive","No date yet","Lloyd Greenwood","PHDA - Lloyd Greenwood Collection","Pennine Horizons Digital Archive","TIFF file 8-bit","English (U.K.)","Documentary photograph",LLG00399.tif,,,,,,,,,,,,,,,,,,,,,,,,,,,,,,,,,,,,"Edwardian dress?,Stage play,Theatre",https://penninehorizons.org/files/original/1c38b7ce66a888983b162e094bfffa00.jpg,"Still Image","Lloyd Greenwood collection",1,0
9629,https://penninehorizons.org/items/show/9629,"Unknown Stage Play with 4 actors - LLG00400",Theatre,,,"Pennine Horizons Digital Archive","Pennine Horizons Digital Archive","No date yet","Lloyd Greenwood","PHDA - Lloyd Greenwood Collection","Pennine Horizons Digital Archive","TIFF file 8-bit","English (U.K.)","Documentary photograph",LLG00400.tif,,,,,,,,,,,,,,,,,,,,,,,,,,,,,,,,,,,,Theatre,https://penninehorizons.org/files/original/9d894fe2afd7b1ff3545a64696e4da7a.jpg,"Still Image","Lloyd Greenwood collection",1,0
