﻿"Item Id","Item URI","Dublin Core:Title","Dublin Core:Subject","Dublin Core:Description","Dublin Core:Creator","Dublin Core:Source","Dublin Core:Publisher","Dublin Core:Date","Dublin Core:Contributor","Dublin Core:Rights","Dublin Core:Relation","Dublin Core:Format","Dublin Core:Language","Dublin Core:Type","Dublin Core:Identifier","Dublin Core:Coverage","Item Type Metadata:Lesson Plan Text","Item Type Metadata:Bibliography","Item Type Metadata:Biographical Text","Item Type Metadata:Occupation","Item Type Metadata:Death Date","Item Type Metadata:Birthplace","Item Type Metadata:Birth Date","Item Type Metadata:Participants","Item Type Metadata:Event Type","Item Type Metadata:URL","Item Type Metadata:Bit Rate/Frequency","Item Type Metadata:Interviewer","Item Type Metadata:Interviewee","Item Type Metadata:Location","Item Type Metadata:Transcription","Item Type Metadata:Local URL","Item Type Metadata:Original Format","Item Type Metadata:Physical Dimensions","Item Type Metadata:Duration","Item Type Metadata:Compression","Item Type Metadata:Producer","Item Type Metadata:Director","Item Type Metadata:Text","Item Type Metadata:Time Summary","Item Type Metadata:Email Body","Item Type Metadata:Subject Line","Item Type Metadata:From","Item Type Metadata:To","Item Type Metadata:CC","Item Type Metadata:BCC","Item Type Metadata:Number of Attachments","Item Type Metadata:Standards","Item Type Metadata:Objectives","Item Type Metadata:Materials",tags,file,itemType,collection,public,featured
37153,https://penninehorizons.org/items/show/37153,"Cross Street Demolition 1968 - TAS01649","Building, Demolition, Todmorden",,,,"Pennine Horizons Digital Archive",2014-10-05T19:05:24,,"PHDA - Todmorden Antiquarian Society","Pennine Horizons Digital Archive","TIFF file 8-bit","English (U.K.)","Documentary photograph",TAS01649.jpg,,,,,,,,,,,,,,,,,,,,,,,,,,,,,,,,,,,,"Building,Demolition,Terraced Houses,Todmorden",https://penninehorizons.org/files/original/dd9194409f26ad4ac87f589e5766bf8f.jpg,"Still Image","Todmorden General",1,0
20833,https://penninehorizons.org/items/show/20833,"Dereliction in Hebden Bridge - WSC00249","Buildings, Cars, Dereliction, Double Decker Houses, Hangingroyd Mill, Hebden Bridge, Mill, Mills, Places, Road, Street Names, Terraced Houses, Transport, Valley Road, lorries","Site of part of Hangingroyd Mill at the top of Valley Road with the mill yard to the left. The site now occupied by Waterside Fold.","W. Shepherd","Pennine Horizons Digital Archive","Pennine Horizons Digital Archive",2015-09-04T13:56:42,"W. Shepherd","PHDA - W. Shepherd Collection","Pennine Horizons Digital Archive","TIFF file 8-bit","English (U.K.)","Documentary photograph",WSC00249.tif,,,,,,,,,,,,,,,,,,,,,,,,,,,,,,,,,,,,"Buildings,Cars,Dereliction,Double Decker Houses,Hangingroyd Mill,Hebden Bridge,lorries,Mill,Mills,Places,Road,Street Names,Terraced Houses,Transport,Valley Road",https://penninehorizons.org/files/original/d3a52d87660265f67e3368f71b2ea0c4.jpg,"Still Image","W. Shepherd collection",1,0
23124,https://penninehorizons.org/items/show/23124,"Eiffel Street, Hebden Bridge - DEF00206","Architecture, Birchcliffe Road, Buildings, Double Decker Houses, Edward Street, Eiffel Street, Hebden Bridge, Street Names, Terraced Houses","Birchcliffe Road, with Eiffel Street the first on the left and Edward Street the second. The date on the stone at the top of this first end house is 1839, and on the end house on the corner of Edward Street, the date is 1899.",Unknown,"Pennine Horizons Digital Archive","Pennine Horizons Digital Archive","No date yet",,"PHDA - David Fletcher Collection","Pennine Horizons Digital Archive","TIFF file 8-bit","English (U.K.)","Documentary photograph",DEF00206.tif,,,,,,,,,,,,,,,,,,,,,,,,,,,,,,,,,,,,"Architecture,Birchcliffe Road,Buildings,Double Decker Houses,Edward Street,Eiffel Street,Hebden Bridge,Street Names,Terraced Houses",https://penninehorizons.org/files/original/71a99a95ee2013f4f62bd04dc051f8cc.jpg,"Still Image","David Fletcher collection",1,0
6800,https://penninehorizons.org/items/show/6800,"Entrance to Buttress Brink, Hebden Bridge in the mid-1950s - HLS05045","1950s, Buildings, Buttress Brink, Hebden Bridge, Lantern Slide, Places, Steps, Tenements, Terraced Houses, The Buttress, Yard","The ginnel and steps up into Buttress Brink, a warren of dwellings on different levels at the bottom of the Buttress opposite the Hole-in-the-Wall Inn.They were demolished in 1967 as unfit for human habitation ""where occupants had to walk through a gloomy ground floor tunnel still lit by gas lamps, climb steep steps set into an almost vertical hillside, then cross bridges spanning the gaps between hillside and property. Needless to say the homes within boasted no modern amenities such as bathrooms and toilets; the kitchens, small and cramped, had only a single cold water tap over a stone sink"". (Milltown Memories magazine Isse No.1)",,,,2013-02-05T15:07:04,"HLS05045. ","PHDA - Hebden Bridge Local History Society","Pennine Horizons Digital Archive","TIFF file 8-bit","English (U.K.)","Documentary photograph",HLS05045.tif,,,,,,,,,,,,,,,,,,,,,,,,,,,,,,,,,,,,"1950s,Buildings,Buttress Brink,Hebden Bridge,Lantern Slide,Steps,Tenements,Terraced Houses,The Buttress,Yard",https://penninehorizons.org/files/original/0d7588f418c943ef1344e67e4c585896.jpg,"Still Image","Hebden Bridge Local History Society",1,0
20791,https://penninehorizons.org/items/show/20791,"Foster Lane area of Hebden Bridge - WSC00207","Buildings, Chimneys, Double Decker Houses, Foster Mill, Hangingroyd Mill, Hebden Bridge, Mill, Mills, Nutclough Mill, Terraced Houses","Partly hidden by the tree on the left is the main building of Foster Mill and then partly hidden by the tree on the right is Hangingroyd Mill and above it Nutclough Mill, the only one to remain.","W. Shepherd","Pennine Horizons Digital Archive","Pennine Horizons Digital Archive","No date yet","W. Shepherd","PHDA - W. Shepherd Collection","Pennine Horizons Digital Archive","TIFF file 8-bit","English (U.K.)","Documentary photograph",WSC00207.tif,,,,,,,,,,,,,,,,,,,,,,,,,,,,,,,,,,,,"Buildings,Chimneys,Double Decker Houses,Foster Mill,Hangingroyd Mill,Hebden Bridge,Mill,Mills,Nutclough Mill,Terraced Houses",https://penninehorizons.org/files/original/191dd75299983c4f1effa0420505b13f.jpg,"Still Image","W. Shepherd collection",1,0
20794,https://penninehorizons.org/items/show/20794,"Foster Lane area of Hebden Bridge - WSC00210","Buildings, Chimney, Chimneys, Double Decker Houses, Foster  Mill, Hangingroyd Mill, Hebden Bridge, Industry, Mill, Mills, Nutclough Mill, Terraced Houses","Looking acros an industrial scene to the Birchcliffe hillside.  Behind the trees on the left is Foster Mill and below the terraced houses on the hillside is Nutclough Mill and below that Hangingroyd Mill.","W. Shepherd","Pennine Horizons Digital Archive","Pennine Horizons Digital Archive","No date yet","W. Shepherd","PHDA - W. Shepherd Collection","Pennine Horizons Digital Archive","TIFF file 8-bit","English (U.K.)","Documentary photograph",WSC00210.tif,,,,,,,,,,,,,,,,,,,,,,,,,,,,,,,,,,,,"Buildings,Chimney,Chimneys,Double Decker Houses,Foster  Mill,Hangingroyd Mill,Hebden Bridge,Industry,Mill,Mills,Nutclough Mill,Terraced Houses",https://penninehorizons.org/files/original/d637e66719dd6d2fe2d3b6582b064c51.jpg,"Still Image","W. Shepherd collection",1,0
20809,https://penninehorizons.org/items/show/20809,"Foster Lane Area, Hebden Bridge. - WSC00225","Buildings, Chimneys, Foster  Mill, Foster Lane, Hebden Bridge, Heptonstall, Hollins, Mill, Mills, Places, Street Names, Terraced Houses, Trees, hillside","In the centre of the photo is Foster Mill and above it Hollins and on the top of the hillside houses in Heptonstall.","W. Shepherd","Pennine Horizons Digital Archive","Pennine Horizons Digital Archive",2013-01-26T12:16:40,"W. Shepherd","PHDA - W. Shepherd Collection","Pennine Horizons Digital Archive","TIFF file 8-bit","English (U.K.)","Documentary photograph",WSC00225.tif,,,,,,,,,,,,,,,,,,,,,,,,,,,,,,,,,,,,"Buildings,Chimneys,Foster  Mill,Foster Lane,Hebden Bridge,Heptonstall,hillside,Hollins,Mill,Mills,Places,Street Names,Terraced Houses,Trees",https://penninehorizons.org/files/original/865d4f70962614da26aa58e4f718851f.jpg,"Still Image","W. Shepherd collection",1,0
20799,https://penninehorizons.org/items/show/20799,"Foster Lane, Hebden Bridge. - WSC00215","Foster Lane, Hebden Bridge, Street Names, Terraced Houses, Trees","Looking down Foster Lane, Hebden Bridge","W. Shepherd","Pennine Horizons Digital Archive","Pennine Horizons Digital Archive",2013-01-26T12:13:31,"W. Shepherd","PHDA - W. Shepherd Collection","Pennine Horizons Digital Archive","TIFF file 8-bit","English (U.K.)","Documentary photograph",WSC00215.tif,,,,,,,,,,,,,,,,,,,,,,,,,,,,,,,,,,,,"Foster Lane,Hebden Bridge,Street Names,Terraced Houses,Trees",https://penninehorizons.org/files/original/b3fd30a9661b50c59f508db4e09ae3f8.jpg,"Still Image","W. Shepherd collection",1,0
20800,https://penninehorizons.org/items/show/20800,"Foster Lane, Hebden Bridge. - WSC00216","Foster Lane, Hebden Bridge, Lees Road, Street Names, Terraced Houses, Trees, Turnpike, hillside","Looking down from its junction with Keighley Road. Going off to the  right is Lees Road which was part of the original 1815 turnpike road to Keighley.","W. Shepherd","Pennine Horizons Digital Archive","Pennine Horizons Digital Archive",2013-01-26T12:14:01,"W. Shepherd","PHDA - W. Shepherd Collection","Pennine Horizons Digital Archive","TIFF file 8-bit","English (U.K.)","Documentary photograph",WSC00216.tif,,,,,,,,,,,,,,,,,,,,,,,,,,,,,,,,,,,,"Foster Lane,Hebden Bridge,hillside,Lees Road,Street Names,Terraced Houses,Trees,Turnpike",https://penninehorizons.org/files/original/afc6ee9adf56fefb0ece5aa3e0384de1.jpg,"Still Image","W. Shepherd collection",1,0
20242,https://penninehorizons.org/items/show/20242,"Foster Mill, Hebden Bridge. - KEC00446","Buildings, Foster Mill, Frying Pan Alley, Hebden Bridge, Mill, Mills, Terraced Houses","To the left of the mill terraced housing on Windsor Lane and to the right of the chimney Highfield Crescent nicknamed locally Frying Pan Alley. The mill ceased production in 1978 and was subsequently demolished. Part of the Hebden Bridge Local History Society Archive","Kenneth Crabtree","Pennine Horizons Digital Archive","Pennine Horizons Digital Archive","No date yet","Hebden Bridge Local History Society","PHDA - Hebden Bridge Local History Society","Pennine Horizons Digital Archive","TIFF file 8-bit","English (U.K.)","Documentary photograph",KEC00446.tif,"Hebden Bridge",,,,,,,,,,,,,,,,,,,,,,,,,,,,,,,,,,,"Buildings,Foster Mill,Frying Pan Alley,Hebden Bridge,Mill,Mills,Terraced Houses",https://penninehorizons.org/files/original/5be7c174ff6a262ba645868e16435dcd.jpg,"Still Image","Ken Crabtree Collection",1,0
33986,https://penninehorizons.org/items/show/33986,"Gauxholme Viaduct. - PNH00832","Building, Canal, Canals, Chimney, Chimneys, Gauxholme, Gauxholme Viaduct, Houses, Lancashire & Yorkshire Railway, Moorland, Railway, Railways, Terraced Houses, Townscape, Transport, Viaduct","General view pre-1914 over the No. 1 Viaduct and canal bridge looking up towards Walsden.",,,"Pennine Horizons Digital Archive",2012-02-05T13:08:41,,"PHDA - Pennine Heritage Collection","Pennine Horizons Digital Archive","TIFF file 8-bit","English (U.K.)","Documentary photograph",PNH00832.tif,,,,,,,,,,,,,,,,,,,,,,,,,,,,,,,,,,,,"Building,Canal,Canals,Chimney,Chimneys,Gauxholme,Gauxholme Viaduct,Houses,Lancashire & Yorkshire Railway,Moorland,Railway,Railways,Terraced Houses,Townscape,Transport,Viaduct",https://penninehorizons.org/files/original/a2f85f2b42e2f40ebf17afc0a77785b7.jpg,"Still Image","Pennine Heritage Collection",1,0
33987,https://penninehorizons.org/items/show/33987,"Gauxholme, Shade School - PNH00833","Building, Chimney, Chimneys, Gauxholme, Gauxholme Viaduct, Houses, Lancashire & Yorkshire Railway, Moorland, Railway, Railways, Shade School, Terraced Houses, Townscape, Viaduct","The newly built Shade School in 1904. Righthand corner the skew bridge over the Rochdale Canal with its castellated buttresses.",,,"Pennine Horizons Digital Archive",2012-02-05T13:18:23,,"PHDA - Pennine Heritage Collection","Pennine Horizons Digital Archive","TIFF file 8-bit","English (U.K.)","Documentary photograph",PNH00833.tif,,,,,,,,,,,,,,,,,,,,,,,,,,,,,,,,,,,,"Building,Chimney,Chimneys,Gauxholme,Gauxholme Viaduct,Houses,Lancashire & Yorkshire Railway,Moorland,Railway,Railways,Shade School,Terraced Houses,Townscape,Viaduct",https://penninehorizons.org/files/original/1838ffb1feec2f5f93897aeff7cf69e1.jpg,"Still Image","Pennine Heritage Collection",1,0
20612,https://penninehorizons.org/items/show/20612,"General View Hebden Bridge. - WAO00219","Central Street, Church, Churches & Chapels, Churches_&_Chapels, Cross_Lanes_Chapel, General View, Grammar School, Hebden Bridge, Mill Chimneys, Minster, Pitt Street, School, Terraced Houses","Undated postcard. Towards top left is Cross Lanes Chapel which was destroyed by fire in the mid-1960s having closed for worship in 1958.","Strand Series. W.H.S&S., Hx","Pennine Horizons Digital Archive","Pennine Horizons Digital Archive","No date yet","Wayne Ogden","PHDA - Wayne Ogden Collection","Pennine Horizons Digital Archive","TIFF file 8-bit","English (U.K.)","Documentary photograph",WAO00219.tif,,,,,,,,,,,,,,,,,,,,,,,,,,,,,,,,,,,,"Central Street,Church,Churches & Chapels,Churches_&_Chapels,Cross_Lanes_Chapel,General View,Grammar School,Hebden Bridge,Mill Chimneys,Minster,Pitt Street,School,Terraced Houses",https://penninehorizons.org/files/original/da5b0eba8b10dbaf1325af9c3a39e92b.jpg,"Still Image","Wayne Ogden collection",1,0
20863,https://penninehorizons.org/items/show/20863,"General View of Hangingroyd Area, Hebden Bridge  - WSC00279","Birchcliffe, Buildings, Chiserley, Frying Pan Alley, Hangingroyd Lane, Hangingroyd Mill, Hebden Bridge, Hebden Works, Mill, Mills, Nutclough Mill, Old Town, Street Names, Terraced Houses","Looking down from above Heptonstall Road. Lower right are the terraced houses off Hangingroyd Lane with the housing on Birchcliffe hillside above. Almost in the centre is part of Hangingroyd Mill and diagonally above it Hebden Works and Nutclough Mill. Centre left is Highfield Crescent known locally as 'Frying Pan Alley' and at the top are the houses at Chiserley and Old Town.","W. Shepherd","Pennine Horizons Digital Archive","Pennine Horizons Digital Archive",2015-09-05T13:33:44^^2017-05-04,"W. Shepherd","PHDA - W. Shepherd Collection","Pennine Horizons Digital Archive","TIFF file 8-bit","English (U.K.)","Documentary photograph",WSC00279.tif,,,,,,,,,,,,,,,,,,,,,,,,,,,,,,,,,,,,"Birchcliffe,Buildings,Chiserley,Frying Pan Alley,Hangingroyd Lane,Hangingroyd Mill,Hebden Bridge,Hebden Works,Mill,Mills,Nutclough Mill,Old Town,Street Names,Terraced Houses,Townscape",https://penninehorizons.org/files/original/155c5a441c6cdb882421b40f346e7aaf.jpg,"Still Image","W. Shepherd collection",1,0
20862,https://penninehorizons.org/items/show/20862,"Hangingroyd Area, Hebden Bridge General View - WSC00278","Birchcliffe, Buildings, Chiserley, Frying Pan Alley, Hangingroyd Lane, Hangingroyd Mill, Hebden Bridge, Hebden Works, Mill, Mills, Nutclough Mill, Old Town, Street Names, Terraced Houses","Looking down from above Heptonstall Road. Lower right terraced houses off Hangingroyd Lane with housing on Birchcliffe Hillside above. Almost in the centre ia part of Hangingroyd Mill and diagonally above it Hebden Works and Nutclough Mill. Centre left 'Frying Pan Alley' and at the top houses at Chiserley and Old Town.","W. Shepherd","Pennine Horizons Digital Archive","Pennine Horizons Digital Archive",2015-09-05T13:33:39,"W. Shepherd","PHDA - W. Shepherd Collection","Pennine Horizons Digital Archive","TIFF file 8-bit","English (U.K.)","Documentary photograph",WSC00278.tif,,,,,,,,,,,,,,,,,,,,,,,,,,,,,,,,,,,,"Birchcliffe,Buildings,Chiserley,Frying Pan Alley,Hangingroyd Lane,Hangingroyd Mill,Hebden Bridge,Hebden Works,Mill,Mills,Nutclough Mill,Old Town,Street Names,Terraced Houses,Townscape",https://penninehorizons.org/files/original/a0f6049f67ec1b843214cd0a9db62266.jpg,"Still Image","W. Shepherd collection",1,0
20827,https://penninehorizons.org/items/show/20827,"Hangingroyd Mill, Hebden Bridge  - WSC00243","Buildings, Dereliction, Hangingroyd Mill, Hebden Bridge, Houses, Mill, Mills, Places, Terraced Houses, lorries","Yard and part of the derelict Hangingroyd Mill at the top of Valley Road. Waterside Fold is now on part of the yard and the two mill buildings seen here across the river have gone.  Between the two buildings Broughton Street can be seen going up to Foster Lane.","W. Shepherd","Pennine Horizons Digital Archive","Pennine Horizons Digital Archive",2015-09-04T13:55:11,"W. Shepherd","PHDA - W. Shepherd Collection","Pennine Horizons Digital Archive","TIFF file 8-bit","English (U.K.)","Documentary photograph",WSC00243.tif,,,,,,,,,,,,,,,,,,,,,,,,,,,,,,,,,,,,"Buildings,Dereliction,Hangingroyd Mill,Hebden Bridge,Houses,lorries,Mill,Mills,Places,Terraced Houses",https://penninehorizons.org/files/original/32963722ffd7ae12603a0bc141669b49.jpg,"Still Image","W. Shepherd collection",1,0
20828,https://penninehorizons.org/items/show/20828,"Hangingroyd Mill, Hebden Bridge  - WSC00244","Buildings, Dereliction, Hangingroyd Mill, Hebden Bridge, Houses, Mill, Mills, Places, Terraced Houses","In the foreground the former mill yard at the top of Valley Road now partly occupied by Waterside Fold. Across the river one of the mill's buildings remaining in a state of dereliction.","W. Shepherd","Pennine Horizons Digital Archive","Pennine Horizons Digital Archive",2015-09-04T13:55:23,"W. Shepherd","PHDA - W. Shepherd Collection","Pennine Horizons Digital Archive","TIFF file 8-bit","English (U.K.)","Documentary photograph",WSC00244.tif,,,,,,,,,,,,,,,,,,,,,,,,,,,,,,,,,,,,"#Mill,Buildings,Dereliction,Hangingroyd Mill,Hebden Bridge,Houses,Mill,Mills,Places,Terraced Houses",https://penninehorizons.org/files/original/abd46964556b247934d81960fa9fefb6.jpg,"Still Image","W. Shepherd collection",1,0
20843,https://penninehorizons.org/items/show/20843,"Hangingroyd Mill, Hebden Bridge. - WSC00259","Buildings, Derelict mill, Gate, Gate Pillars, Gate post, Gate posts, Gatepost, Gateposts, Gates, Gateway, Hangingroyd Lane, Hangingroyd Mill, Hebden Bridge, Houses, Mill, Mills, Moss Lane, Street Names, Terraced Houses, lorries","Viewed from the top of Hangingroyd Lane with Moss Lane running across in front of the mill gates. Shepherd's wagons parked up on  part on the site of a demolished building and part the mill yard. The view today is of houses on Waterside Fold.","W. Shepherd","Pennine Horizons Digital Archive","Pennine Horizons Digital Archive",2015-09-05T13:31,"W. Shepherd","PHDA - W. Shepherd Collection","Pennine Horizons Digital Archive","TIFF file 8-bit","English (U.K.)","Documentary photograph",WSC00259.tif,,,,,,,,,,,,,,,,,,,,,,,,,,,,,,,,,,,,"Buildings,Derelict mill,Gate,Gate Pillars,Gate post,Gate posts,Gatepost,Gateposts,Gates,Gateway,Hangingroyd Lane,Hangingroyd Mill,Hebden Bridge,Houses,lorries,Mill,Mills,Moss Lane,Street Names,Terraced Houses",https://penninehorizons.org/files/original/428a524b829dc187815f84310e6d5985.jpg,"Still Image","W. Shepherd collection",1,0
20841,https://penninehorizons.org/items/show/20841,"Hangingroyd Mill, Valley Road, Hebden Bridge. - WSC00257","Buildings, Flats, Hangingroyd Mill, Hebden Bridge, Mill, Mills, Playground, Terraced Houses, lorries","Shepherds lorries in the yard of the former Hangingroyd Mill looking across the river to the new playground on Victoria Road, formerly site of one of the mill's buildings, and the new flats.","W. Shepherd","Pennine Horizons Digital Archive","Pennine Horizons Digital Archive",2015-09-04T13:58:45,"W. Shepherd","PHDA - W. Shepherd Collection","Pennine Horizons Digital Archive","TIFF file 8-bit","English (U.K.)","Documentary photograph",WSC00257.tif,,,,,,,,,,,,,,,,,,,,,,,,,,,,,,,,,,,,"Buildings,Flats,Hangingroyd Mill,Hebden Bridge,lorries,Mill,Mills,Playground,Terraced Houses",https://penninehorizons.org/files/original/a6cb433d4337b14c423d387d21e41e48.jpg,"Still Image","W. Shepherd collection",1,0
20165,https://penninehorizons.org/items/show/20165,"Hangingroyd, Hebden Bridge. - KEC00369","Hebden Bridge, Mill Chimneys, Terraced Houses","Hangingroyd c.1890. In the foreground is the Hangingroyd area. To the left Nutclough Mill. Part of the Hebden Bridge Local History Society Archive","Kenneth Crabtree","Pennine Horizons Digital Archive","Pennine Horizons Digital Archive","No date yet","Hebden Bridge Local History Society","PHDA - Hebden Bridge Local History Society","Pennine Horizons Digital Archive","TIFF file 8-bit","English (U.K.)","Documentary photograph",KEC00369.tif,"Hebden Bridge",,,,,,,,,,,,,,,,,,,,,,,,,,,,,,,,,,,"Hebden Bridge,Mill Chimneys,Terraced Houses",https://penninehorizons.org/files/original/0ff05fc4acb10ae7eda951411a51b9f8.jpg,"Still Image","Ken Crabtree Collection",1,0
6830,https://penninehorizons.org/items/show/6830,"Hebden Bridge ","Adelaide Street, Bankfoot Mill, Buildings, Canal, Canals, Church, Churches & Chapels, Churches_&_Chapels, Colden Valley, Eaves Mills, General View, Graveyard, Hall, Hebden Bridge, Heptonstall Church, Houses, Lantern Slide, Mill, Mills, Minster, Mytholm, Mytholm Hall, Named mill, Places, Rochdale Canal, St James, St James', Street Names, Stubbing Holme, Stubbing Holme Dye Works, Terraced Houses, Transport","HLS05081. Right of centre is Stubbing Holme Dyeworks between the Rochdale Canal and the River Calder. Above it Adelaide Street and above that Bankfoot Mill. In the centre Mytholm Hall, St James Parish Church and Eaves Mills. The Hall and all the mills have now beeen demolished. On the skyline is the tower of Heptonstall Church above Eaves Rocks.",,,,"No date yet",,"PHDA - Hebden Bridge Local History Society","Pennine Horizons Digital Archive","TIFF file 8-bit","English (U.K.)","Documentary photograph",HLS05081.tif,,,,,,,,,,,,,,,,,,,,,,,,,,,,,,,,,,,,"Adelaide Street,Bankfoot Mill,Buildings,Canal,Church,Churches and Chapels,Colden Valley,Eaves Mills,General View,Graveyard,Hall,Hebden Bridge,Heptonstall Church,Houses,Lantern Slide,Mill,Mills,Minster,Mytholm,Mytholm Hall,Named mill,Rochdale Canal,St James,St James',Street Names,Stubbing Holme,Stubbing Holme Dye Works,Terraced Houses,Transport",https://penninehorizons.org/files/original/6aff9b623c44ed1212f14a0edc4d5eb7.jpg,"Still Image","Hebden Bridge Local History Society",1,0
6774,https://penninehorizons.org/items/show/6774,"Hebden Bridge - Birchcliffe and Stubbings Hillside C1880 - HLS05017","Birchcliffe, Birchcliffe Road, Buildings, Chimney, Chimneys, Cliffe Street, General View, Hebden Bridge, Houses, Lantern Slide, Mill, Mills, Nutclough Mill, Places, Street Names, Terraced Houses, Tin Tabernacle","Foster Holme from Lee Wood possibly about 1890 with Nutclough Mill and chimney; tin tabernacle is left of centre.",,,,1880s,,"PHDA - Hebden Bridge Local History Society","Pennine Horizons Digital Archive","TIFF file 8-bit","English (U.K.)","Documentary photograph",HLS05017.tif,,,,,,,,,,,,,,,,,,,,,,,,,,,,,,,,,,,,"Birchcliffe,Birchcliffe Road,Buildings,Chimney,Chimneys,Cliffe Street,General View,Hebden Bridge,Houses,Lantern Slide,Mill,Mills,Nutclough Mill,Street Names,Terraced Houses,Tin Tabernacle",https://penninehorizons.org/files/original/bfc0fc32e253d2fa2050f60e5aa6616c.jpg,"Still Image","Hebden Bridge Local History Society",1,0