﻿"Item Id","Item URI","Dublin Core:Title","Dublin Core:Subject","Dublin Core:Description","Dublin Core:Creator","Dublin Core:Source","Dublin Core:Publisher","Dublin Core:Date","Dublin Core:Contributor","Dublin Core:Rights","Dublin Core:Relation","Dublin Core:Format","Dublin Core:Language","Dublin Core:Type","Dublin Core:Identifier","Dublin Core:Coverage","Item Type Metadata:Lesson Plan Text","Item Type Metadata:Bibliography","Item Type Metadata:Biographical Text","Item Type Metadata:Occupation","Item Type Metadata:Death Date","Item Type Metadata:Birthplace","Item Type Metadata:Birth Date","Item Type Metadata:Participants","Item Type Metadata:Event Type","Item Type Metadata:URL","Item Type Metadata:Bit Rate/Frequency","Item Type Metadata:Interviewer","Item Type Metadata:Interviewee","Item Type Metadata:Location","Item Type Metadata:Transcription","Item Type Metadata:Local URL","Item Type Metadata:Original Format","Item Type Metadata:Physical Dimensions","Item Type Metadata:Duration","Item Type Metadata:Compression","Item Type Metadata:Producer","Item Type Metadata:Director","Item Type Metadata:Text","Item Type Metadata:Time Summary","Item Type Metadata:Email Body","Item Type Metadata:Subject Line","Item Type Metadata:From","Item Type Metadata:To","Item Type Metadata:CC","Item Type Metadata:BCC","Item Type Metadata:Number of Attachments","Item Type Metadata:Standards","Item Type Metadata:Objectives","Item Type Metadata:Materials",tags,file,itemType,collection,public,featured
11798,https://penninehorizons.org/items/show/11798,"Construction of the New Bridge over the Rochdale Canal, 29th June 1986 - RSC00213","Brearley, Buildings, Canal, Canals, Colour, Construction, Places, Tow Path, Transport","Work seen here is just outside Mytholmroyd.","Raymond Stell","Pennine Horizons Digital Archive","Pennine Horizons Digital Archive","No date yet","Raymond Stell","PHDA - Raymond Stell","Pennine Horizons Digital Archive","TIFF file 8-bit","English (U.K.)","Documentary photograph",RSC00213.tif,"Hebden Bridge",,,,,,,,,,,,,,,,,,,,,,,,,,,,,,,,,,,"Brearley,Buildings,Canal,Colour,Construction,Tow Path,Transport",https://penninehorizons.org/files/original/fca7f84a6b36417f1633351d9475c16c.jpg,"Still Image","Raymond Stell collection ",1,0
11791,https://penninehorizons.org/items/show/11791,"Construction of New Bridge over the Rochdale Canal, April 1986 - RSC00206","Brearley, Buildings, Canal, Canals, Colour, Construction, Crane, Cranes, Places, Tow Path, Transport","The bridge is situated just outside Mytholmroyd.","Raymond Stell","Pennine Horizons Digital Archive","Pennine Horizons Digital Archive","No date yet","Raymond Stell","PHDA - Raymond Stell","Pennine Horizons Digital Archive","TIFF file 8-bit","English (U.K.)","Documentary photograph",RSC00206.tif,"Hebden Bridge",,,,,,,,,,,,,,,,,,,,,,,,,,,,,,,,,,,"Brearley,Buildings,Canal,Colour,Construction,Crane,Cranes,Tow Path,Transport",https://penninehorizons.org/files/original/71d8bcfaa69d2b9418708ad41afc7014.jpg,"Still Image","Raymond Stell collection ",1,0
11790,https://penninehorizons.org/items/show/11790,"The Swing Bridge over the Rochdale Canal - RSC00205","Brearley, Buildings, Canal, Canals, Colour, Construction, Places, Tow Path, Transport","The bridge is situated just outside Mytholmroyd.","Raymond Stell","Pennine Horizons Digital Archive","Pennine Horizons Digital Archive","No date yet","Raymond Stell","PHDA - Raymond Stell","Pennine Horizons Digital Archive","TIFF file 8-bit","English (U.K.)","Documentary photograph",RSC00205.tif,"Hebden Bridge",,,,,,,,,,,,,,,,,,,,,,,,,,,,,,,,,,,"Brearley,Buildings,Canal,Colour,Construction,Tow Path,Transport",https://penninehorizons.org/files/original/e49f64ad1390c1b573d5753629ea79d7.jpg,"Still Image","Raymond Stell collection ",1,0
24835,https://penninehorizons.org/items/show/24835,"Gauxholme Bridge on the Rochdale Canal - RDA00124","Barge, Canal, Canals, Copperas House, Gauxholme, Horse, Tow Path, Transport, Walsden","Built by the Manchester & Leeds Railway in 1840 and always known by them as Gauxholme Bridge but locally referred to as Coppras House Bridge. It was one of the very first Bow String Bridges in the country along with Whiteley Arches, near Hebden Bridge. The under girder was added 1905 to provide extra support.","J.A. Hardaker","Rene Dawson","Pennine Horizons Digital Archive","No date yet","Rene Dawson","PHDA - Rene Dawson Collection","Pennine Horizons Digital Archive","TIFF file 8-bit","English (U.K.)","Documentary photograph",RDA00124.TIF,,,,,,,,,,,,,,,,,,,,,,,,,,,,,,,,,,,,"Barge,Canal,Gauxholme,Horse,Todmorden,Tow Path,Transport",https://penninehorizons.org/files/original/baa07c78bb8c724313b6e1b077516028.jpg,"Still Image","Rene Dawson Collection",1,0
5893,https://penninehorizons.org/items/show/5893,"Navigation Bridge, Midgley road, Mytholmroyd,1962 - HBC00953 ","Bridge, Canal, Canals, Mytholmroyd, Places, Tow Path, Transport",,"J. Woodhead","Hebden Bridge Camera Club","Pennine Horizons Digital Archive",1960s,"Hebden Bridge Camera Club","PHDA - Hebden Bridge Camera Club","Pennine Horizons Digital Archive","TIFF file 8-bit","English (U.K.)","Documentary photograph",HBC00953.tif,,,,,,,,,,,,,,,,,,,,,,,,,,,,,,,,,,,,"1960s,Bridge,Canal,Mytholmroyd,Tow Path,Transport",https://penninehorizons.org/files/original/9e3b5826639125e7b1456f8f139bac6b.jpg,"Still Image","Hebden Bridge Camera Club - The Changing Face of Hebden Bridge",1,0
5892,https://penninehorizons.org/items/show/5892,"Navigation Bridge, Midgley road, Mytholmroyd,1962 - HBC00952 ","Bridge, Buildings, Canal, Canals, Churches_&_Chapels, Mytholmroyd, Places, Retail, Shop, Shops, Tow Path, Transport, Zion Chapel",,"J. Woodhead","Hebden Bridge Camera Club","Pennine Horizons Digital Archive",1960s,"Hebden Bridge Camera Club","PHDA - Hebden Bridge Camera Club","Pennine Horizons Digital Archive","TIFF file 8-bit","English (U.K.)","Documentary photograph",HBC00952.tif,,,,,,,,,,,,,,,,,,,,,,,,,,,,,,,,,,,,"1960s,Bridge,Buildings,Canal,Churches and Chapels,Mytholmroyd,Retail,Shop,Shops,Tow Path,Transport,Zion Chapel",https://penninehorizons.org/files/original/f6172365d7664c72a95c0fba6145674d.jpg,"Still Image","Hebden Bridge Camera Club - The Changing Face of Hebden Bridge",1,0
5883,https://penninehorizons.org/items/show/5883,"Canal Bridge, Pismire Hill, Mytholmroyd, 1963 - HBC00937 ","Bridge, Canal, Canals, Mill, Mytholmroyd, Places, Scout Rocks, Tow Path, Transport","Showing the strengthening work that has been carried out on the bridge.","J. Woodhead","Hebden Bridge Camera Club","Pennine Horizons Digital Archive",1960s,"Hebden Bridge Camera Club","PHDA - Hebden Bridge Camera Club","Pennine Horizons Digital Archive","TIFF file 8-bit","English (U.K.)","Documentary photograph",HBC00937.tif,,,,,,,,,,,,,,,,,,,,,,,,,,,,,,,,,,,,"1960s,Bridge,Canal,Mill,Mytholmroyd,Scout Rocks,Tow Path,Transport",https://penninehorizons.org/files/original/9e6c27fffa498c52fce65173e71897c0.jpg,"Still Image","Hebden Bridge Camera Club - The Changing Face of Hebden Bridge",1,0
5882,https://penninehorizons.org/items/show/5882,"Canal Bridge, Pismire Hill, Mytholmroyd, 1963 - HBC00936 ","Bridge, Canal, Canals, Mill, Mytholmroyd, Places, Tow Path, Transport",,"J. Woodhead","Hebden Bridge Camera Club","Pennine Horizons Digital Archive",1960s,"Hebden Bridge Camera Club","PHDA - Hebden Bridge Camera Club","Pennine Horizons Digital Archive","TIFF file 8-bit","English (U.K.)","Documentary photograph",HBC00936.tif,,,,,,,,,,,,,,,,,,,,,,,,,,,,,,,,,,,,"1960s,Bridge,Canal,Mill,Mytholmroyd,Tow Path,Transport",https://penninehorizons.org/files/original/7d92740f547e768a520c03ffbe02ed9f.jpg,"Still Image","Hebden Bridge Camera Club - The Changing Face of Hebden Bridge",1,0
5881,https://penninehorizons.org/items/show/5881,"Canal Bridge, Pismire Hill, Mytholmroyd, 1960 - HBC00935 ","Bridge, Buildings, Canal, Canals, Construction, Mill, Mytholmroyd, Places, Tow Path, Transport",,"J. Woodhead","Hebden Bridge Camera Club","Pennine Horizons Digital Archive",1960s,"Hebden Bridge Camera Club","PHDA - Hebden Bridge Camera Club","Pennine Horizons Digital Archive","TIFF file 8-bit","English (U.K.)","Documentary photograph",HBC00935.tif,,,,,,,,,,,,,,,,,,,,,,,,,,,,,,,,,,,,"1960s,Bridge,Buildings,Canal,Construction,Mill,Mytholmroyd,Tow Path,Transport",https://penninehorizons.org/files/original/395695cc352e0d30895c893b1a1e6907.jpg,"Still Image","Hebden Bridge Camera Club - The Changing Face of Hebden Bridge",1,0
5833,https://penninehorizons.org/items/show/5833,"Broadbottom Bridge, Mytholmroyd, 1962 - HBC00887 ","Bridge, Canal, Canals, Mytholmroyd, Places, Tow Path, Transport",,"J. Woodhead","Hebden Bridge Camera Club","Pennine Horizons Digital Archive",1960s,"Hebden Bridge Camera Club","PHDA - Hebden Bridge Camera Club","Pennine Horizons Digital Archive","TIFF file 8-bit","English (U.K.)","Documentary photograph",HBC00887.tif,,,,,,,,,,,,,,,,,,,,,,,,,,,,,,,,,,,,"1960s,Bridge,Canal,Mytholmroyd,Tow Path,Transport",https://penninehorizons.org/files/original/938311f3d3c001157fc48f8dafce7697.jpg,"Still Image","Hebden Bridge Camera Club - The Changing Face of Hebden Bridge",1,0
5832,https://penninehorizons.org/items/show/5832,"Broadbottom Bridge, Mytholmroyd, 1962 - HBC00886 ","Bridge, Buildings, Canal, Canals, Mill, Mills, Mytholmroyd, Places, Tow Path, Transport","Hawksclough Mill is on the right.","J. Woodhead","Hebden Bridge Camera Club","Pennine Horizons Digital Archive",1960s,"Hebden Bridge Camera Club","PHDA - Hebden Bridge Camera Club","Pennine Horizons Digital Archive","TIFF file 8-bit","English (U.K.)","Documentary photograph",HBC00886.tif,,,,,,,,,,,,,,,,,,,,,,,,,,,,,,,,,,,,"1960s,Bridge,Buildings,Canal,Mill,Mills,Mytholmroyd,Tow Path,Transport",https://penninehorizons.org/files/original/c0c7851f627ff50fb7c9016573589fc7.jpg,"Still Image","Hebden Bridge Camera Club - The Changing Face of Hebden Bridge",1,0
5791,https://penninehorizons.org/items/show/5791,"Fallingroyd Bridge, 1962 - HBC00845 ","Bridge, Canal, Canals, Tow Path, Transport",,"J. Woodhead","Hebden Bridge Camera Club","Pennine Horizons Digital Archive",1960s,"Hebden Bridge Camera Club","PHDA - Hebden Bridge Camera Club","Pennine Horizons Digital Archive","TIFF file 8-bit","English (U.K.)","Documentary photograph",HBC00845.tif,,,,,,,,,,,,,,,,,,,,,,,,,,,,,,,,,,,,"1960s,Bridge,Canal,Tow Path,Transport",https://penninehorizons.org/files/original/b5330fe1a177b78d99bf3f5dde01db01.jpg,"Still Image","Hebden Bridge Camera Club - The Changing Face of Hebden Bridge",1,0
5790,https://penninehorizons.org/items/show/5790,"Fallingroyd Bridge, 1962 - HBC00844 ","Bridge, Bus, Canal, Canals, Road, Tow Path, Transport",,"J. Woodhead","Hebden Bridge Camera Club","Pennine Horizons Digital Archive",1960s,"Hebden Bridge Camera Club","PHDA - Hebden Bridge Camera Club","Pennine Horizons Digital Archive","TIFF file 8-bit","English (U.K.)","Documentary photograph",HBC00844.tif,,,,,,,,,,,,,,,,,,,,,,,,,,,,,,,,,,,,"1960s,Bridge,Bus,Canal,Road,Tow Path,Transport",https://penninehorizons.org/files/original/608d0b3c35f8d4e17bffb012c070e997.jpg,"Still Image","Hebden Bridge Camera Club - The Changing Face of Hebden Bridge",1,0
5743,https://penninehorizons.org/items/show/5743,"Canal Bridge, Brearley, 1962 - HBC00797 ","Brearley, Bridge, Mill, Places, Rochdale Canal, Tow path",,"J. Woodhead","Hebden Bridge Camera Club","Pennine Horizons Digital Archive",1960s,"Hebden Bridge Camera Club","PHDA - Hebden Bridge Camera Club","Pennine Horizons Digital Archive","TIFF file 8-bit","English (U.K.)","Documentary photograph",HBC00797.tif,,,,,,,,,,,,,,,,,,,,,,,,,,,,,,,,,,,,"1960s,Brearley,Bridge,Mill,Rochdale Canal,Tow Path",https://penninehorizons.org/files/original/2f1161a2bb6b91f5a2309bafff5db289.jpg,"Still Image","Hebden Bridge Camera Club - The Changing Face of Hebden Bridge",1,0
5742,https://penninehorizons.org/items/show/5742,"Canal Bridge, Brearley, 1962 - HBC00796 ","Brearley, Bridge, Mill, Places, Rochdale Canal, Tow path",,"J. Woodhead","Hebden Bridge Camera Club","Pennine Horizons Digital Archive",1960s,"Hebden Bridge Camera Club","PHDA - Hebden Bridge Camera Club","Pennine Horizons Digital Archive","TIFF file 8-bit","English (U.K.)","Documentary photograph",HBC00796.tif,,,,,,,,,,,,,,,,,,,,,,,,,,,,,,,,,,,,"1960s,Brearley,Bridge,Mill,Rochdale Canal,Tow Path",https://penninehorizons.org/files/original/ba9b609b20a92c367ffc379a4f1726e2.jpg,"Still Image","Hebden Bridge Camera Club - The Changing Face of Hebden Bridge",1,0
5730,https://penninehorizons.org/items/show/5730,"Upper Foot Canal Bridge, 1962 - HBC00784 ","Bridge, Canal, Canals, Rochdale Canal, Tow Path, Transport, Upper Foot",,"J. Woodhead","Hebden Bridge Camera Club","Pennine Horizons Digital Archive",1960s,"Hebden Bridge Camera Club","PHDA - Hebden Bridge Camera Club","Pennine Horizons Digital Archive","TIFF file 8-bit","English (U.K.)","Documentary photograph",HBC00784.tif,,,,,,,,,,,,,,,,,,,,,,,,,,,,,,,,,,,,"1960s,Bridge,Canal,Rochdale Canal,Tow Path,Transport,Upper Foot",https://penninehorizons.org/files/original/09b3bbbae47e1a2acca5dbf4e38d8069.jpg,"Still Image","Hebden Bridge Camera Club - The Changing Face of Hebden Bridge",1,0
5729,https://penninehorizons.org/items/show/5729,"Upper Foot Canal Bridge, 1962 - HBC00783 ","Bridge, Canal, Canals, Rochdale Canal, Tow Path, Transport, Upper Foot",,"J. Woodhead","Hebden Bridge Camera Club","Pennine Horizons Digital Archive",1960s,"Hebden Bridge Camera Club","PHDA - Hebden Bridge Camera Club","Pennine Horizons Digital Archive","TIFF file 8-bit","English (U.K.)","Documentary photograph",HBC00783.tif,,,,,,,,,,,,,,,,,,,,,,,,,,,,,,,,,,,,"1960s,Bridge,Canal,Rochdale Canal,Tow Path,Transport,Upper Foot",https://penninehorizons.org/files/original/6b1be1ac4bb18b6e04e946eee62eb52e.jpg,"Still Image","Hebden Bridge Camera Club - The Changing Face of Hebden Bridge",1,0
5725,https://penninehorizons.org/items/show/5725,"Harwood's Footbridge, Brearley, Mytholmroyd, 1963 - HBC00779 ","Brearley, Bridge, Footbridge, Places, Rochdale Canal, Tow path",,"J. Woodhead","Hebden Bridge Camera Club","Pennine Horizons Digital Archive",1960s,"Hebden Bridge Camera Club","PHDA - Hebden Bridge Camera Club","Pennine Horizons Digital Archive","TIFF file 8-bit","English (U.K.)","Documentary photograph",HBC00779.tif,,,,,,,,,,,,,,,,,,,,,,,,,,,,,,,,,,,,"1960s,Brearley,Bridge,Footbridge,Rochdale Canal,Tow Path",https://penninehorizons.org/files/original/f309356f43e6f58482ed5885f234709c.jpg,"Still Image","Hebden Bridge Camera Club - The Changing Face of Hebden Bridge",1,0
3784,https://penninehorizons.org/items/show/3784,"Canal Bridge, Hawksclough - EEH00105","Canal, Canals, Colour, Tow Path, Transport",,"Eddie Haworth","Pennine Horizons Digital Archive","Pennine Horizons Digital Archive",2014-11-29T10:27:22,"Jeanette Thomas","PHDA - Eddie Haworth Collection","Pennine Horizons Digital Archive","TIFF file 8-bit","English (U.K.)","Documentary photograph",EEH00105.tif,,,,,,,,,,,,,,,,,,,,,,,,,,,,,,,,,,,,"Canal,Colour,Tow Path,Transport",https://penninehorizons.org/files/original/7996557c022df1fdc4b567bd22293e01.jpg,"Still Image","Eddie Haworth collection",1,0
3602,https://penninehorizons.org/items/show/3602,"Rochdale Canal, Hebden Bridge - DTA00252","Buildings, Calder  Holmes, Canal, Canals, Chimneys, Crossley Mill, Hebden Bridge, Mill, Mills, Parks, Places, Rochdale Canal, Tow Path, Transport","The Rochdale Canal at Hebden Bridge, and Calder Holmes Park","Donald Taylor","Pennine Horizons Digital Archive","Pennine Horizons Digital Archive","No date yet","Donald Taylor","PHDA - Donald Taylor Collection","Pennine Horizons Digital Archive","TIFF file 8-bit","English (U.K.)","Documentary photograph",DTA00252.tif,,,,,,,,,,,,,,,,,,,,,,,,,,,,,,,,,,,,"Buildings,Calder  Holmes,Canal,Chimneys,Crossley Mill,Hebden Bridge,Mill,Mills,Parks,Rochdale Canal,Tow Path,Transport",https://penninehorizons.org/files/original/9538d4ae7db33b012295a035831c44e2.jpg,"Still Image","Donald Taylor collection",1,0
3421,https://penninehorizons.org/items/show/3421,"The Rochdale Canal at Mytholmroyd - DBC00116","Canal, Canals, Donald Crossley, Mytholmroyd, People, Places, Ted Hughes, Tow Path, Transport",,"Donald Crossley","Pennine Horizons Digital Archive","Pennine Horizons Digital Archive","No date yet","Donald Crossley","PHDA - Donald Crossley Collection","Pennine Horizons Digital Archive","TIFF file 8-bit","English (U.K.)","Documentary photograph",DBC00116.tif,,,,,,,,,,,,,,,,,,,,,,,,,,,,,,,,,,,,"Canal,Donald Crossley,Mytholmroyd,People,Ted Hughes,Tow Path,Transport",https://penninehorizons.org/files/original/4056bae0f4e1fed0e0a10ed9338d781c.jpg,"Still Image","Donald Crossley collection",1,0
4552,https://penninehorizons.org/items/show/4552,"Rochdale Canal & Woodhouse Mill - DMC00280","Buildings, Canal, Canals, Chimney, Chimneys, Lock, Mill, Mills, Rochdale Canal, Tow Path, Transport, Woodhouse Mill",,"David Martin","Pennine Horizons Digital Archive","Pennine Horizons Digital Archive",2010-04-08T15:21:15,"David Martin","PHDA - David Martin Collection","Pennine Horizons Digital Archive","TIFF file 8-bit","English (U.K.)","Documentary photograph",DMC00280.TIF,",  ",,,,,,,,,,,,,,,,,,,,,,,,,,,,,,,,,,,"Buildings,Canal,Chimney,Chimneys,Lock,Mill,Mills,Rochdale Canal,Tow Path,Transport,Woodhouse Mill",https://penninehorizons.org/files/original/33be9acf00eaaa29ab5066d0c61c4418.jpg,"Still Image","David's Own Pictures",1,0
4538,https://penninehorizons.org/items/show/4538,"Fielden Wharf, Rochdale Canal, Todmorden - DMC00257","Canal, Canals, Fielden Wharf, Places, Rochdale Canal, Todmorden, Tow Path, Transport",,"David Martin","Pennine Horizons Digital Archive","Pennine Horizons Digital Archive",2009-09-12T14:13:54,"David Martin","PHDA - David Martin Collection","Pennine Horizons Digital Archive","TIFF file 8-bit","English (U.K.)","Documentary photograph",DMC00257.TIF,",  ",,,,,,,,,,,,,,,,,,,,,,,,,,,,,,,,,,,"Canal,Fielden Wharf,Rochdale Canal,Todmorden,Tow Path,Transport",https://penninehorizons.org/files/original/4ca74760a2e53f1e67dbcf8551e0b766.jpg,"Still Image","David's Own Pictures",1,0
4536,https://penninehorizons.org/items/show/4536,"Rochdale Canal, Warland, Walsden - DMC00255","Canal, Canals, Lock, Rochdale Canal, Tow Path, Transport, Walsden","Longlees Lock","David Martin","Pennine Horizons Digital Archive","Pennine Horizons Digital Archive",2009-09-07T15:16:52,"David Martin","PHDA - David Martin Collection","Pennine Horizons Digital Archive","TIFF file 8-bit","English (U.K.)","Documentary photograph",DMC00255.TIF,",  ",,,,,,,,,,,,,,,,,,,,,,,,,,,,,,,,,,,"Canal,Lock,Rochdale Canal,Tow Path,Transport,Walsden",https://penninehorizons.org/files/original/b8ea4409dc4db3e4f6bef0e28ea15458.jpg,"Still Image","David's Own Pictures",1,0
4535,https://penninehorizons.org/items/show/4535,"Rochdale Canal, Walsden - DMC00254","Barge, Canal, Canals, Narrow boat, Rochdale Canal, Tow Path, Transport, Walsden",,"David Martin","Pennine Horizons Digital Archive","Pennine Horizons Digital Archive",2009-09-07T14:49:58,"David Martin","PHDA - David Martin Collection","Pennine Horizons Digital Archive","TIFF file 8-bit","English (U.K.)","Documentary photograph",DMC00254.TIF,",  ",,,,,,,,,,,,,,,,,,,,,,,,,,,,,,,,,,,"Barge,Canal,Narrow boat,Rochdale Canal,Tow Path,Transport,Walsden",https://penninehorizons.org/files/original/3d9c77a01133ff60cb154dbcd0d825c1.jpg,"Still Image","David's Own Pictures",1,0
