﻿"Item Id","Item URI","Dublin Core:Title","Dublin Core:Subject","Dublin Core:Description","Dublin Core:Creator","Dublin Core:Source","Dublin Core:Publisher","Dublin Core:Date","Dublin Core:Contributor","Dublin Core:Rights","Dublin Core:Relation","Dublin Core:Format","Dublin Core:Language","Dublin Core:Type","Dublin Core:Identifier","Dublin Core:Coverage","Item Type Metadata:Lesson Plan Text","Item Type Metadata:Bibliography","Item Type Metadata:Biographical Text","Item Type Metadata:Occupation","Item Type Metadata:Death Date","Item Type Metadata:Birthplace","Item Type Metadata:Birth Date","Item Type Metadata:Participants","Item Type Metadata:Event Type","Item Type Metadata:URL","Item Type Metadata:Bit Rate/Frequency","Item Type Metadata:Interviewer","Item Type Metadata:Interviewee","Item Type Metadata:Location","Item Type Metadata:Transcription","Item Type Metadata:Local URL","Item Type Metadata:Original Format","Item Type Metadata:Physical Dimensions","Item Type Metadata:Duration","Item Type Metadata:Compression","Item Type Metadata:Producer","Item Type Metadata:Director","Item Type Metadata:Text","Item Type Metadata:Time Summary","Item Type Metadata:Email Body","Item Type Metadata:Subject Line","Item Type Metadata:From","Item Type Metadata:To","Item Type Metadata:CC","Item Type Metadata:BCC","Item Type Metadata:Number of Attachments","Item Type Metadata:Standards","Item Type Metadata:Objectives","Item Type Metadata:Materials",tags,file,itemType,collection,public,featured
37593,https://penninehorizons.org/items/show/37593,"Town Gate, Sowerby - RAC1961.053.10","Vernacular Architecture","Demolition of cottages numbers 47 - 51","Ralph Cross",,"Pennine Horizons Digital Archive",1961,,"PHDA - Ralph Cross Collection","Pennine Horizons Digital Archive","TIFF file 8-bit","English (U.K.)","Documentary photograph",RAC1961.053.10.jpg,,,,,,,,,,,,,,,,,,,,,,,,,,,,,,,,,,,,"Demolition,Post,Vernacular architecture",https://penninehorizons.org/files/original/9ef1c4b1e9e2e6d1684ced30f292f437.jpg,"Still Image","Ralph Cross 1961",1,0
26898,https://penninehorizons.org/items/show/26898,"Top of Winding Road, Halifax, c. early 1980s - CBC06194","Building, Chimney, Chimneys, Demolition, Halifax","This is the view of the top of Winding Road.  The buildings in the immediate foreground are now the site of the bus station.",,"Pennine Horizons Digital Archive","Pennine Horizons Digital Archive",,,"PHDA - Calderdale MBC","Pennine Horizons Digital Archive","TIFF file 8-bit","English (U.K.)","Documentary photograph",CBC06194.tif,,,,,,,,,,,,,,,,,,,,,,,,,,,,,,,,,,,,"Building,Chimney,Chimneys,Demolition,Halifax",https://penninehorizons.org/files/original/bf90488c8ca4df7298f08102fe1c5502.jpg,"Still Image","CMBC Conservation and Planning collection",1,0
27149,https://penninehorizons.org/items/show/27149,"Todmorden Co-op, Dale Street, Todmorden - TAL00190","Building, Co-op Building, Co-operative Movement, Demolition, Todmorden","AN 34131981",,"Todmorden Antiquarian Society","Pennine Horizons Digital Archive",2000,,"PHDA - Todmorden Antiquarian Society","Pennine Horizons Digital Archive","TIFF file 8-bit","English (U.K.)","Documentary photograph",TAL00190.tif,,,,,,,,,,,,,,,,,,,,,,,,,,,,,,,,,,,,"Building,Co-op Building,Co-operative Movement,Demolition,Todmorden",https://penninehorizons.org/files/original/1d0b4984ec7e6a7da9f0cd35aad4772b.jpg,"Still Image","Todmorden Antiquarian Society Photographs at the Library",1,0
10995,https://penninehorizons.org/items/show/10995,"Todmorden - BIM00178","Buildings, Co-operative  Building, Demolition, Places, Todmorden, Transport","August 2000","Bill Marsden","Bill Marsden","Pennine Horizons Digital Archive",1990s,,"PHDA - Bill Marsden Collection","Pennine Horizons Digital Archive","TIFF file 8-bit","English (U.K.)","Documentary photograph",BIM00178.tif,"Hebden Bridge",,,,,,,,,,,,,,,,,,,,,,,,,,,,,,,,,,,"Buildings,Co-operative  Building,Demolition,Todmorden,Transport",https://penninehorizons.org/files/original/d848a6b6df60251c3393006532d6649d.jpg,"Still Image","Bill Marsden collection",1,0
10994,https://penninehorizons.org/items/show/10994,"Todmorden - BIM00177","Buildings, Co-operative  Building, Demolition, Places, Todmorden, Transport","August 2000","Bill Marsden","Bill Marsden","Pennine Horizons Digital Archive",1990s,,"PHDA - Bill Marsden Collection","Pennine Horizons Digital Archive","TIFF file 8-bit","English (U.K.)","Documentary photograph",BIM00177.tif,"Hebden Bridge",,,,,,,,,,,,,,,,,,,,,,,,,,,,,,,,,,,"Buildings,Co-operative  Building,Demolition,Todmorden,Transport",https://penninehorizons.org/files/original/d5f115e6b6d410ee06eaee6fdce5732e.jpg,"Still Image","Bill Marsden collection",1,0
10984,https://penninehorizons.org/items/show/10984,"Todmorden - BIM00167","Buildings, Co-operative  Building, Demolition, Places, Todmorden, Transport","August 2000 following demolition of the Co-op.","Bill Marsden","Bill Marsden","Pennine Horizons Digital Archive",1990s,,"PHDA - Bill Marsden Collection","Pennine Horizons Digital Archive","TIFF file 8-bit","English (U.K.)","Documentary photograph",BIM00167.tif,"Hebden Bridge",,,,,,,,,,,,,,,,,,,,,,,,,,,,,,,,,,,"Buildings,Co-operative  Building,Demolition,Todmorden,Transport",https://penninehorizons.org/files/original/b285c931c68c147750e9315a32176b94.jpg,"Still Image","Bill Marsden collection",1,0
10983,https://penninehorizons.org/items/show/10983,"Todmorden - BIM00166","Buildings, Co-operative  Building, Demolition, Places, Todmorden","August 2000","Bill Marsden","Bill Marsden","Pennine Horizons Digital Archive",1990s,,"PHDA - Bill Marsden Collection","Pennine Horizons Digital Archive","TIFF file 8-bit","English (U.K.)","Documentary photograph",BIM00166.tif,"Hebden Bridge",,,,,,,,,,,,,,,,,,,,,,,,,,,,,,,,,,,"Buildings,Co-operative  Building,Demolition,Todmorden",https://penninehorizons.org/files/original/7760396fcd79082e46c6739c7360e86b.jpg,"Still Image","Bill Marsden collection",1,0
10982,https://penninehorizons.org/items/show/10982,"Todmorden - BIM00165","Buildings, Co-operative  Building, Demolition, Places, Todmorden, Transport","August 2000","Bill Marsden","Bill Marsden","Pennine Horizons Digital Archive",1990s,,"PHDA - Bill Marsden Collection","Pennine Horizons Digital Archive","TIFF file 8-bit","English (U.K.)","Documentary photograph",BIM00165.tif,"Hebden Bridge",,,,,,,,,,,,,,,,,,,,,,,,,,,,,,,,,,,"Buildings,Co-operative  Building,Demolition,Todmorden,Transport",https://penninehorizons.org/files/original/2ae9edef43224c431b1bb820eee2af12.jpg,"Still Image","Bill Marsden collection",1,0
34173,https://penninehorizons.org/items/show/34173,"There she goes! - PNH01993","Building, Chimney, Chimneys, Demolition, Mill, Mills","Mayroyd area, Hebden Bridge. The chimney from Mayroyd Mill is just going to miss Victoria Mill. The telepone box is directly opposite the station entrance.",,,"Pennine Horizons Digital Archive",,,"PHDA - Pennine Heritage Collection","Pennine Horizons Digital Archive","TIFF file 8-bit","English (U.K.)","Documentary photograph",PNH01993.tif,,,,,,,,,,,,,,,,,,,,,,,,,,,,,,,,,,,,"Building,Chimney,Chimneys,Demolition,Mill,Mills",https://penninehorizons.org/files/original/71fb71607ab5aea491ed69ca9f7d56e0.jpg,"Still Image","Pennine Heritage Collection",1,0
11832,https://penninehorizons.org/items/show/11832,"There She Goes - RSC00247","Brearley, Buildings, Chimney, Chimneys, Demolition, Mill, Places","Demolition of mill chimney at Brearley","Raymond Stell","Pennine Horizons Digital Archive","Pennine Horizons Digital Archive","No date yet","Raymond Stell","PHDA - Raymond Stell","Pennine Horizons Digital Archive","TIFF file 8-bit","English (U.K.)","Documentary photograph",RSC00247.tif,"Hebden Bridge",,,,,,,,,,,,,,,,,,,,,,,,,,,,,,,,,,,"Brearley,Buildings,Chimney,Chimneys,Demolition,Mill",https://penninehorizons.org/files/original/37df24e9f7d1a072cda2e1a66eae4af7.jpg,"Still Image","Raymond Stell collection ",1,0
11184,https://penninehorizons.org/items/show/11184,"The Rochdale Canal at Todmorden - BIM00367","Buildings, Co-operative  Building, Demolition, Places, Snow, Todmorden, Town Hall, Whirlaw Stones","August 2000","Bill Marsden","Bill Marsden","Pennine Horizons Digital Archive",1990s,,"PHDA - Bill Marsden Collection","Pennine Horizons Digital Archive","TIFF file 8-bit","English (U.K.)","Documentary photograph",BIM00367.tif,Todmorden,,,,,,,,,,,,,,,,,,,,,,,,,,,,,,,,,,,"Buildings,Co-operative  Building,Demolition,Snow,Todmorden,Town Hall,Whirlaw Stones",https://penninehorizons.org/files/original/51c3d7c8ba07c3ef06de425b0bc6c99f.jpg,"Still Image","Bill Marsden collection",1,0
11183,https://penninehorizons.org/items/show/11183,"The Rochdale Canal at Todmorden - BIM00366","Buildings, Co-operative  Building, Cross Stone, Demolition, Places, Rochdale Canal, Todmorden, Town Hall, Transport","The pediment of Todmorden town Hall can just be seen on the left, centre is the partially demolished former Co-op building, the tower of Cross Stone Church can be seen on the sky lineAugust 2000","Bill Marsden","Bill Marsden","Pennine Horizons Digital Archive",1990s,,"PHDA - Bill Marsden Collection","Pennine Horizons Digital Archive","TIFF file 8-bit","English (U.K.)","Documentary photograph",BIM00366.tif,Todmorden,,,,,,,,,,,,,,,,,,,,,,,,,,,,,,,,,,,"Buildings,Co-operative  Building,Cross Stone,Demolition,Rochdale Canal,Todmorden,Town Hall,Transport",https://penninehorizons.org/files/original/4177b14914f985b1744ec9785f8c581e.jpg,"Still Image","Bill Marsden collection",1,0
11151,https://penninehorizons.org/items/show/11151,"The Remains of a Once Proud Mill - BIM00334","Buildings, Colour, Demolition, Mill, Mills, Mons Mill, Places, Todmorden, Transport","Mons Mill, Todmorden was a cotton spinning mill in Todmorden, Calderdale, West Yorkshire for the Hare Spinning Company Limited. It was built in 1907, but ran into financial difficulties. It passed over to the Mons Mill (1919) Co Ltd and then was taken over by the Lancashire Cotton Corporation in the 1930s and passed to Courtaulds in 1964 and production stopped in 1968. It was used into the 1990s by Ward & Goldestone Ltd. The site was cleared in 2000.","Bill Marsden","Bill Marsden","Pennine Horizons Digital Archive",1990s,,"PHDA - Bill Marsden Collection","Pennine Horizons Digital Archive","TIFF file 8-bit","English (U.K.)","Documentary photograph",BIM00334.tif,Todmorden,,,,,,,,,,,,,,,,,,,,,,,,,,,,,,,,,,,"Buildings,Colour,Demolition,Mill,Mills,Mons Mill,Todmorden,Transport",https://penninehorizons.org/files/original/1f566c77fbc3352f271a28c81d6e659f.jpg,"Still Image","Bill Marsden collection",1,0
286,https://penninehorizons.org/items/show/286,"The Old Toffee Works, Brearley, 1966 - AGW00205","Brearley, Civic Trust, Dereliction, Places","‘Man at Large’ was a series of photographs taken as part of a Calder Civic Trust initiative to increase awareness of eyesores in the area, in stark contrast to the well dressed gentleman, John D. Uttley.

Amazingly, considering the amount of space between the mill and the river, this site was used as a toffee works and later for the manufacture of caravans.","Alan Greenwood","Alan Greenwood","Pennine Horizons Digital Archive",1970s,"Alan Greenwood","PHDA - Alan Greenwood Collection","Pennine Horizons Digital Archive","TIFF file 8-bit","English (U.K.)","Documentary photograph",AGW00205.tif,"Hebden Bridge",,,,,,,,,,,,,,,,,,,,,,,,,,,,,,,,,,,"1960s,Barbed wire,Bowler Hat,Brearley,Civic Trust,Demolition,Dereliction,Man",https://penninehorizons.org/files/original/0bef1eaa8f74ee5ae69d3da3ec6b31d6.jpg,"Still Image","Alan Greenwood Collection",1,0
285,https://penninehorizons.org/items/show/285,"The Old Toffee Works, Brearley, 1966 - AGW00204","Brearley, Civic Trust, Dereliction, Places","‘Man at Large’ was a series of photographs taken as part of a Calder Civic Trust initiative to increase awareness of eyesores in the area, in stark contrast to the well dressed gentleman, John D. Uttley.","Alan Greenwood","Alan Greenwood","Pennine Horizons Digital Archive",1970s,"Alan Greenwood","PHDA - Alan Greenwood Collection","Pennine Horizons Digital Archive","TIFF file 8-bit","English (U.K.)","Documentary photograph",AGW00204.tif,"Hebden Bridge",,,,,,,,,,,,,,,,,,,,,,,,,,,,,,,,,,,"1960s,Barbed wire,Bowler Hat,Brearley,Civic Trust,Demolition,Dereliction,Umbrella",https://penninehorizons.org/files/original/938bb2951fa5ac0b1b5ffef45191cdc5.jpg,"Still Image","Alan Greenwood Collection",1,0
24300,https://penninehorizons.org/items/show/24300,"The former Walsden Printing Works - CRN00261","Buildings, Demolition, Derelict, Industry, Printing Works, Walsden",,"Christine Newell","Christine Newell","Pennine Horizons Digital Archive","2002 , 2000s","Christine Newell","PHDA - Christine Newell Collection","Pennine Horizons Digital Archive","TIFF file 8-bit","English (U.K.)","Documentary photograph",CRN00261.tif,,,,,,,,,,,,,,,,,,,,,,,,,,,,,,,,,,,,"Buildings,Demolition,Derelict,Industry,Printing Works,Walsden",https://penninehorizons.org/files/original/8036ffd57957dc79fdc61536568ed5d7.jpg,"Still Image","Christine Newell collection",1,0
11187,https://penninehorizons.org/items/show/11187,"The former Co-op building at Todmorden - BIM00370","Buildings, Co-operative  Building, Demolition, Places, Todmorden","August 2000","Bill Marsden","Bill Marsden","Pennine Horizons Digital Archive",1990s,,"PHDA - Bill Marsden Collection","Pennine Horizons Digital Archive","TIFF file 8-bit","English (U.K.)","Documentary photograph",BIM00370.tif,Todmorden,,,,,,,,,,,,,,,,,,,,,,,,,,,,,,,,,,,"Buildings,Co-operative  Building,Demolition,Todmorden",https://penninehorizons.org/files/original/1dd295cc74ba379a9a09572da6d5bb9b.jpg,"Still Image","Bill Marsden collection",1,0
11186,https://penninehorizons.org/items/show/11186,"The former Co-op building at Todmorden - BIM00369","Buildings, Co-operative  Building, Demolition, Places, Todmorden, Valley","August 2000","Bill Marsden","Bill Marsden","Pennine Horizons Digital Archive",1990s,,"PHDA - Bill Marsden Collection","Pennine Horizons Digital Archive","TIFF file 8-bit","English (U.K.)","Documentary photograph",BIM00369.tif,Todmorden,,,,,,,,,,,,,,,,,,,,,,,,,,,,,,,,,,,"Buildings,Co-operative  Building,Demolition,Todmorden,Valley",https://penninehorizons.org/files/original/2bd05524f86d6a732c97e14f5cab0b97.jpg,"Still Image","Bill Marsden collection",1,0
11185,https://penninehorizons.org/items/show/11185,"The former Co-op building at Todmorden - BIM00368","Buildings, Church, Churches & Chapels, Churches_&_Chapels, Co-operative  Building, Demolition, Minster, Parish Church, Places, Todmorden","August 2000","Bill Marsden","Bill Marsden","Pennine Horizons Digital Archive",1990s,,"PHDA - Bill Marsden Collection","Pennine Horizons Digital Archive","TIFF file 8-bit","English (U.K.)","Documentary photograph",BIM00368.tif,Todmorden,,,,,,,,,,,,,,,,,,,,,,,,,,,,,,,,,,,"Buildings,Church,Churches and Chapels,Co-operative  Building,Demolition,Minster,Parish Church,Todmorden",https://penninehorizons.org/files/original/6a18fc65eb57af1e480cabc50b6d004b.jpg,"Still Image","Bill Marsden collection",1,0
11182,https://penninehorizons.org/items/show/11182,"The former Co-op building at Todmorden - BIM00365","Buildings, Co-operative  Building, Demolition, Places, Todmorden, Transport","August 2000","Bill Marsden","Bill Marsden","Pennine Horizons Digital Archive",1990s,,"PHDA - Bill Marsden Collection","Pennine Horizons Digital Archive","TIFF file 8-bit","English (U.K.)","Documentary photograph",BIM00365.tif,Todmorden,,,,,,,,,,,,,,,,,,,,,,,,,,,,,,,,,,,"Buildings,Co-operative  Building,Demolition,Todmorden,Transport",https://penninehorizons.org/files/original/fdaa10840eaed1ebcb6a28caa52816b7.jpg,"Still Image","Bill Marsden collection",1,0
11181,https://penninehorizons.org/items/show/11181,"The former Co-op building at Todmorden - BIM00364","Buildings, Co-operative  Building, Demolition, Places, Todmorden","August 2000","Bill Marsden","Bill Marsden","Pennine Horizons Digital Archive",1990s,,"PHDA - Bill Marsden Collection","Pennine Horizons Digital Archive","TIFF file 8-bit","English (U.K.)","Documentary photograph",BIM00364.tif,Todmorden,,,,,,,,,,,,,,,,,,,,,,,,,,,,,,,,,,,"Buildings,Co-operative  Building,Demolition,Todmorden",https://penninehorizons.org/files/original/6f897ab5b150edd5ed352be487a98516.jpg,"Still Image","Bill Marsden collection",1,0
11180,https://penninehorizons.org/items/show/11180,"The former Co-op Building at Todmorden - BIM00363","Buildings, Co-operative  Building, Colour, Demolition, Places, Todmorden","August 2000","Bill Marsden","Bill Marsden","Pennine Horizons Digital Archive",1990s,,"PHDA - Bill Marsden Collection","Pennine Horizons Digital Archive","TIFF file 8-bit","English (U.K.)","Documentary photograph",BIM00363.tif,Todmorden,,,,,,,,,,,,,,,,,,,,,,,,,,,,,,,,,,,"#Todmorden,Buildings,Co-operative  Building,Colour,Demolition,Todmorden",https://penninehorizons.org/files/original/91dd9f04bc519315fea518709ca53473.jpg,"Still Image","Bill Marsden collection",1,0
11179,https://penninehorizons.org/items/show/11179,"The former Co-op building at Todmorden - BIM00362","Buildings, Co-operative  Building, Demolition, Places, Todmorden","August 2000","Bill Marsden","Bill Marsden","Pennine Horizons Digital Archive",1990s,,"PHDA - Bill Marsden Collection","Pennine Horizons Digital Archive","TIFF file 8-bit","English (U.K.)","Documentary photograph",BIM00362.tif,Todmorden,,,,,,,,,,,,,,,,,,,,,,,,,,,,,,,,,,,"Buildings,Co-operative  Building,Demolition,Todmorden",https://penninehorizons.org/files/original/583a3caf27edc242e872b2d7e6619a76.jpg,"Still Image","Bill Marsden collection",1,0
11178,https://penninehorizons.org/items/show/11178,"The former Co-op building at Todmorden - BIM00361","Buildings, Co-operative  Building, Demolition, Places, Todmorden","August 2000","Bill Marsden","Bill Marsden","Pennine Horizons Digital Archive",1990s,,"PHDA - Bill Marsden Collection","Pennine Horizons Digital Archive","TIFF file 8-bit","English (U.K.)","Documentary photograph",BIM00361.tif,Todmorden,,,,,,,,,,,,,,,,,,,,,,,,,,,,,,,,,,,"Buildings,Co-operative  Building,Demolition,Todmorden",https://penninehorizons.org/files/original/fbcd3a5ee702bfb989b9accb5c01f584.jpg,"Still Image","Bill Marsden collection",1,0
11177,https://penninehorizons.org/items/show/11177,"The former Co-op building at Todmorden - BIM00360","Buildings, Co-operative  Building, Demolition, Places, Todmorden","August 2000","Bill Marsden","Bill Marsden","Pennine Horizons Digital Archive",1990s,,"PHDA - Bill Marsden Collection","Pennine Horizons Digital Archive","TIFF file 8-bit","English (U.K.)","Documentary photograph",BIM00360.tif,Todmorden,,,,,,,,,,,,,,,,,,,,,,,,,,,,,,,,,,,"Buildings,Co-operative  Building,Demolition,Todmorden",https://penninehorizons.org/files/original/76ecb1e65bde1c070da42b99648abae9.jpg,"Still Image","Bill Marsden collection",1,0
