﻿"Item Id","Item URI","Dublin Core:Title","Dublin Core:Subject","Dublin Core:Description","Dublin Core:Creator","Dublin Core:Source","Dublin Core:Publisher","Dublin Core:Date","Dublin Core:Contributor","Dublin Core:Rights","Dublin Core:Relation","Dublin Core:Format","Dublin Core:Language","Dublin Core:Type","Dublin Core:Identifier","Dublin Core:Coverage","Item Type Metadata:Lesson Plan Text","Item Type Metadata:Bibliography","Item Type Metadata:Biographical Text","Item Type Metadata:Occupation","Item Type Metadata:Death Date","Item Type Metadata:Birthplace","Item Type Metadata:Birth Date","Item Type Metadata:Participants","Item Type Metadata:Event Type","Item Type Metadata:URL","Item Type Metadata:Bit Rate/Frequency","Item Type Metadata:Interviewer","Item Type Metadata:Interviewee","Item Type Metadata:Location","Item Type Metadata:Transcription","Item Type Metadata:Local URL","Item Type Metadata:Original Format","Item Type Metadata:Physical Dimensions","Item Type Metadata:Duration","Item Type Metadata:Compression","Item Type Metadata:Producer","Item Type Metadata:Director","Item Type Metadata:Text","Item Type Metadata:Time Summary","Item Type Metadata:Email Body","Item Type Metadata:Subject Line","Item Type Metadata:From","Item Type Metadata:To","Item Type Metadata:CC","Item Type Metadata:BCC","Item Type Metadata:Number of Attachments","Item Type Metadata:Standards","Item Type Metadata:Objectives","Item Type Metadata:Materials",tags,file,itemType,collection,public,featured
13067,https://penninehorizons.org/items/show/13067,"Hebden Bridge Parade - ALC00208","Animals, Band, Demonstration, Event, Events, Hebden Bridge, Horses and Ponies, Music, Parade, Places, Procession, Transport","Could this have been part of the 1911 Coronation celebrations?",,"Pennine Horizons Digital Archive","Pennine Horizons Digital Archive",1910s,,"PHDA - Alice Longstaff Collection","Pennine Horizons Digital Archive","TIFF file 8-bit","English (U.K.)","Documentary photograph",ALC00208.tif,,,,,,,,,,,,,,,,,,,,,,,,,,,,,,,,,,,,"1910s,Animals,Band,Demonstration,Event,Events,Hebden Bridge,Horses and Ponies,Music,Parade,Procession,Transport",https://penninehorizons.org/files/original/66d3eecab45fe62881b2a8b5df679984.jpg,"Still Image","Alice Longstaff - General Pictures",1,0
13059,https://penninehorizons.org/items/show/13059,"Hebden Bridge Parade - ALC00200","Band, Demonstration, Event, Events, Float, Hebden Bridge, Market Street, Music, Parade, Places, Procession, Street Names",,,"Pennine Horizons Digital Archive","Pennine Horizons Digital Archive","No date yet",,"PHDA - Alice Longstaff Collection","Pennine Horizons Digital Archive","TIFF file 8-bit","English (U.K.)","Documentary photograph",ALC00200.tif,,,,,,,,,,,,,,,,,,,,,,,,,,,,,,,,,,,,"Band,Demonstration,Event,Events,Float,Hebden Bridge,Market Street,Music,Parade,Procession,Street Names",https://penninehorizons.org/files/original/de0d4dec4462adc96742dbe7fde7b8cc.jpg,"Still Image","Alice Longstaff -  Gallery collection",1,0
32064,https://penninehorizons.org/items/show/32064,"Hebden Bridge Junior Band - JNB00630","Brass Band, Hebden Bridge, Junior Band, Music, Old Bridge",1984,"Gatehouse Prints",,"Pennine Horizons Digital Archive",,,"PHDA – John Billingsley Collection","Pennine Horizons Digital Archive","TIFF file 8-bit","English (U.K.)","Documentary photograph",JNB00630.tif,,,,,,,,,,,,,,,,,,,,,,,,,,,,,,,,,,,,"Brass Band,Hebden Bridge,Junior Band,Music,Old Bridge",https://penninehorizons.org/files/original/cce36c2662b2de00d7631e79c6331805.jpg,"Still Image","John Billingsley Postcard Collection",1,0
29510,https://penninehorizons.org/items/show/29510,"Hebden Bridge Brass Band, 1953 - MOS00136","Brass Band, Group, Music, Musical instruments, People, Uniform",,,,,,,"PHDA - Molly Sunderland Collection","Pennine Horizons Digital Archive",,"English (U.K.)","Documentary photograph",MOS00136.tif,,,,,,,,,,,,,,,,,,,,,,,,,,,,,,,,,,,,"Brass Band,Group,Music,Musical instruments,People,Uniform",https://penninehorizons.org/files/original/3aaafab4cff6c95e851bd409c4fabd2d.jpg,"Still Image","Molly Sunderland Collection",1,0
13297,https://penninehorizons.org/items/show/13297,"Hebden Bridge Brass Band, 1912 - ALC00475","Brass Band, Hebden Bridge, Music, People","William Simpson-Hinchcliffe is seated in the centre of the picture. The band is proudly showing the trophies they have won as well as their new uniforms which were paid for by Mr Hinchliffe.","Crossley Westerman","Pennine Horizons Digital Archive","Pennine Horizons Digital Archive","No date yet",,"PHDA - Alice Longstaff Collection","Pennine Horizons Digital Archive","TIFF file 8-bit","English (U.K.)","Documentary photograph",ALC00475.tif,,,,,,,,,,,,,,,,,,,,,,,,,,,,,,,,,,,,"Brass Band,Hebden Bridge,Music,People",https://penninehorizons.org/files/original/7f0eb65205a7324acbcb69f413c83bd2.jpg,"Still Image","Alice Longstaff -  Gallery collection",1,0
17888,https://penninehorizons.org/items/show/17888,"Hebden Bridge Brass Band - ALC06315","Brass Band, Music, Musical Instrument",,,"Pennine Horizons Digital Archive","Pennine Horizons Digital Archive","No date yet",,"PHDA - Alice Longstaff Collection","Pennine Horizons Digital Archive","TIFF file 8-bit","English (U.K.)","Documentary photograph",ALC06315.tif,,,,,,,,,,,,,,,,,,,,,,,,,,,,,,,,,,,,"Brass Band,Music,Musical Instrument",https://penninehorizons.org/files/original/70c28dc36e33105aa49d7a90e01173a6.jpg,"Still Image","Alice Longstaff - Group portraits",1,0
17810,https://penninehorizons.org/items/show/17810,"Hebden Bridge Brass Band - ALC06236","Brass Band, Group, Music, People, Trophy",,,"Pennine Horizons Digital Archive","Pennine Horizons Digital Archive","No date yet",,"PHDA - Alice Longstaff Collection","Pennine Horizons Digital Archive","TIFF file 8-bit","English (U.K.)","Documentary photograph",ALC06236.tif,,,,,,,,,,,,,,,,,,,,,,,,,,,,,,,,,,,,"Brass Band,Group,Music,People,Trophy",https://penninehorizons.org/files/original/cc69a2a280aac1bf0ffe485dfdadc24a.jpg,"Still Image","Alice Longstaff - Group portraits",1,0
17809,https://penninehorizons.org/items/show/17809,"Hebden Bridge Brass Band - ALC06235","Brass Band, Group, Music, Musical Instrument, People",,,"Pennine Horizons Digital Archive","Pennine Horizons Digital Archive","No date yet",,"PHDA - Alice Longstaff Collection","Pennine Horizons Digital Archive","TIFF file 8-bit","English (U.K.)","Documentary photograph",ALC06235.tif,,,,,,,,,,,,,,,,,,,,,,,,,,,,,,,,,,,,"Brass Band,Group,Music,Musical Instrument,People",https://penninehorizons.org/files/original/0fe4a0b0fde7aaa8899ec3b97e837ac6.jpg,"Still Image","Alice Longstaff - Group portraits",1,0
6342,https://penninehorizons.org/items/show/6342,"Hebden Bridge Band, c1897 - HLS01028","Brass Band, Hebden Bridge, Music, Places",,,,,1890s,"PH30 - Hebden Bridge Local History Society","PHDA - Hebden Bridge Local History Society","Pennine Horizons Digital Archive","TIFF file 8-bit","English (U.K.)","Documentary photograph",HLS01028.tif,,,,,,,,,,,,,,,,,,,,,,,,,,,,,,,,,,,,"Brass Band,Hebden Bridge,Music",https://penninehorizons.org/files/original/fe31daba68dae6cdd5853d7fe01e27d3.jpg,"Still Image","Hebden Bridge Local History Society",1,0
28154,https://penninehorizons.org/items/show/28154,"Hebden Bridge Band - BBS00101","Brass Band, Group, Hebden Bridge, Music, Musical Instrument, People, Uniform","Winners of the Lascelles Cup 1921/22",,"Pennine Horizons Digital Archive","Pennine Horizons Digital Archive",,,"PHDA - Barbara Shepherd Collection",,"Pennine Horizons Digital Archive","TIFF file 8-bit","English (U.K.)","Documentary photograph",BBS00101.tif,,,,,,,,,,,,,,,,,,,,,,,,,,,,,,,,,,,"Brass Band,Group,Hebden Bridge,Music,Musical Instrument,People,Uniform",https://penninehorizons.org/files/original/f6f8e798a711a2567006937b9b893c23.jpg,"Still Image","Barbara Shepherd Collection",1,0
2038,https://penninehorizons.org/items/show/2038,"Hebden Bridge Arts Festival 2012 - BLP00118","Entertainment, Hebden Bridge Arts Festival 2012, Hepton Singers, Music","Hepton Singers in St Thomas's Church, Heptonstall.","Craig Shaw","Blue Planet Photography ","Pennine Horizons Digital Archive","2010s, 2012-07-01T17:49:01.85","Craig Shaw","PHDA - Craig Shaw Collection","Pennine Horizons Digital Archive","TIFF file 8-bit","English (U.K.)","Documentary photograph",BLP00118.tif,,,,,,,,,,,,,,,,,,,,,,,,,,,,,,,,,,,,"Entertainment,Hebden Bridge Arts Festival 2012,Hepton Singers,Music",https://penninehorizons.org/files/original/26caff76e2e0cc0041a65b4cb3515402.jpg,"Still Image","Craig Shaw - Hebden Bridge Arts Festival 2012",1,0
31586,https://penninehorizons.org/items/show/31586,"Demonstration - MCH00159","Bicycle, Brass Band, Demonstration, Event, Events, Fancy Dress, Horse & Carriage, Music, Mytholmroyd, Places, Road, Tram Lines, Transport","Taken from ""Clough Mill"" which was at the bottom of Midgley Road, Mytholmroyd, looking towards County Bridge. Demonstrations were the forerunner of Mytholmroyd Gala.",,"Mick Chatham","Pennine Horizons Digital Archive",,,"PHDA - Mick Chatham Collection","Pennine Horizons Digital Archive","TIFF file 8-bit","English (U.K.)","Documentary photograph",MCH00159.tif,,,,,,,,,,,,,,,,,,,,,,,,,,,,,,,,,,,,"Bicycle,Brass Band,Demonstration,Event,Events,Fancy Dress,Horse & Carriage,Music,Mytholmroyd,Places,Road,Tram Lines,Transport",https://penninehorizons.org/files/original/765be54cc229e7efb25cbe3815e95d34.jpg,"Still Image","Mick Chatham Collection
",1,0
23628,https://penninehorizons.org/items/show/23628,"Crowning the Rose Queen - PNH00170","Band, Child, Costume, Entertainment, Kirklees, Music","Linthwaite Nurse Fete, June 23rd 1906",Unknown,"Pennine Horizons Digital Archive","Pennine Horizons Digital Archive",1900,"Pennine Heritage","PHDA - Pennine Heritage Collection","Pennine Horizons Digital Archive","TIFF file 8-bit","English (U.K.)","Documentary photograph",PNH00170.tif,,,,,,,,,,,,,,,,,,,,,,,,,,,,,,,,,,,,"Band,Child,Costume,Entertainment,Kirklees,Music",https://penninehorizons.org/files/original/2270bf195e3a95244b1882258edceef4.jpg,"Still Image","Pennine Heritage Collection",1,0
27365,https://penninehorizons.org/items/show/27365,"Cornholme Brass Band, 1920s - TAL00430","Brass Band, Cornholme, Hall, Music, Musical Instrument, Places, Uniform","AN 55941481",,"Todmorden Antiquarian Society","Pennine Horizons Digital Archive",1920,,"PHDA - Todmorden Antiquarian Society","Pennine Horizons Digital Archive","TIFF file 8-bit","English (U.K.)","Documentary photograph",TAL00430.tif,,,,,,,,,,,,,,,,,,,,,,,,,,,,,,,,,,,,"Brass Band,Cornholme,Hall,Music,Musical Instrument,Places,Uniform",https://penninehorizons.org/files/original/1477fab3e3d8159e2540e9025cf77784.jpg,"Still Image","Todmorden Antiquarian Society Photographs at the Library",1,0
27117,https://penninehorizons.org/items/show/27117,"Cornholme Board School Band - TAL00155","Band, Cornholme, Music, Musical Instrument, Places, School","AN 6992647X",,"Todmorden Antiquarian Society","Pennine Horizons Digital Archive",,,"PHDA - Todmorden Antiquarian Society","Pennine Horizons Digital Archive","TIFF file 8-bit","English (U.K.)","Documentary photograph",TAL00155.tif,,,,,,,,,,,,,,,,,,,,,,,,,,,,,,,,,,,,"Band,Cornholme,Music,Musical Instrument,Places,School",https://penninehorizons.org/files/original/a56853241b103a4cc05f5de05b727fb0.jpg,"Still Image","Todmorden Antiquarian Society Photographs at the Library",1,0
200,https://penninehorizons.org/items/show/200,"Classic Car Rally Band, Calder Holmes, Hebden Bridge - AGW00119","Band, Calder Holmes, Event, Events, Hebden Bridge, Music, Parks, Places, Transport",,"Alan Greenwood","Alan Greenwood","Pennine Horizons Digital Archive","2006-08-05T13:04:23+01:00 , 2000s","Alan Greenwood","PHDA - Alan Greenwood Collection","Pennine Horizons Digital Archive","TIFF file 8-bit","English (U.K.)","Documentary photograph",AGW00119.tif,"Hebden Bridge",,,,,,,,,,,,,,,,,,,,,,,,,,,,,,,,,,,"Band,Brass Band,Calder Holmes,Drums,Event,Events,Hebden Bridge,Male,Music,Musical instruments,Musicians,Parks,Transport",https://penninehorizons.org/files/original/0d739d86a8093783ad73da4df70b22d1.jpg,"Still Image","Alan Greenwood Collection",1,0
17824,https://penninehorizons.org/items/show/17824,"California Dance Band - ALC06250","Band, Group, Music, People",,,"Pennine Horizons Digital Archive","Pennine Horizons Digital Archive","No date yet",,"PHDA - Alice Longstaff Collection","Pennine Horizons Digital Archive","TIFF file 8-bit","English (U.K.)","Documentary photograph",ALC06250.tif,,,,,,,,,,,,,,,,,,,,,,,,,,,,,,,,,,,,"Band,Group,Music,People",https://penninehorizons.org/files/original/05e4e8de3a3600a18d9f09375237a1e0.jpg,"Still Image","Alice Longstaff -  Gallery collection",1,0
6071,https://penninehorizons.org/items/show/6071,"Brass Band, Hebden Bridge, c1905 - HLS00100","Brass Band, Group, Hebden Bridge, Machpelah, Music, People, People at Leisure, Places","Brass Band at Machpelah c1905. Ref; 008Morgan",,,,"1905, 1900s",,"PHDA - Hebden Bridge Local History Society","Pennine Horizons Digital Archive","TIFF file 8-bit","English (U.K.)","Documentary photograph",HLS00100.tif,,,,,,,,,,,,,,,,,,,,,,,,,,,,,,,,,,,,"Brass Band,Group,Hebden Bridge,Machpelah,Music,People,People at Leisure",https://penninehorizons.org/files/original/a3bdbb216e7168ca3d2d659fe270f1b7.jpg,"Still Image","Hebden Bridge Local History Society",1,0
6316,https://penninehorizons.org/items/show/6316,"Brass Band,  Hebden Bridge - HLS00447","Albert Street, Brass Band, Children, Cobbles, Hebden Bridge, Hope Street, Music, Musical Instrument, Places, Street Names","Taken outside Lloyds Bank on Albert Street,",,,,"No date yet","Formerly 051 Lit & Sci - AT609.","PHDA - Hebden Bridge Local History Society","Pennine Horizons Digital Archive","TIFF file 8-bit","English (U.K.)","Documentary photograph",HLS00447.TIF,,,,,,,,,,,,,,,,,,,,,,,,,,,,,,,,,,,,"Albert Street,Brass Band,Children,Cobbles,Hebden Bridge,Hope Street,Music,Musical Instrument,Street Names",https://penninehorizons.org/files/original/059d0efb8adbd9e4e3b4647d498941a0.jpg,"Still Image","Hebden Bridge Local History Society",1,0
8912,https://penninehorizons.org/items/show/8912,"Brass Band on Parade at Heptonstall Slack  - KES00142","Banner, Brass Band, Demonstration, Event, Events, Flag, Music, Musical Instrument, Parade, Procession, policeman","The procession is en route to the pavilion at Popples where a gathering was celebrating the Silver Jubilee of King George V in May 1935.",Unknown,"Pennine Horizons Digital Archive","Pennine Horizons Digital Archive","No date yet","Keith Stansfield","PHDA - Keith Stansfield Collection","Pennine Horizons Digital Archive","TIFF file 8-bit","English (U.K.)","Documentary photograph",KES00142.tif,,,,,,,,,,,,,,,,,,,,,,,,,,,,,,,,,,,,"Banner,Brass Band,Demonstration,Event,Flag,Heptonstall Slack,Music,Musical Instrument,Parade,policeman,Procession",https://penninehorizons.org/files/original/f02b720d8867b075d940db8492e5cb74.jpg,"Still Image","Keith Stansfield collection",1,0
10784,https://penninehorizons.org/items/show/10784,"Brass Band on Parade - MOT00464","Band, Buildings, Demonstration, Event, Events, Music, Musical Instrument, Parade, People, People at Leisure, Procession, Retail, Shop, Shops, Uniform","Brass Band on Parade in Todmorden",Unknown,"Todmorden Information Centre Trust","Pennine Horizons Digital Archive","1905, 1900s","Todmorden Information Centre Trust","PHDA - Todmorden Information Centre Trust","Pennine Horizons Digital Archive","TIFF file 8-bit","English (U.K.)","Documentary photograph",MOT00464.tif,Todmorden,,,,,,,,,,,,,,,,,,,,,,,,,,,,,,,,,,,"Band,Buildings,Demonstration,Event,Events,Music,Musical Instrument,Parade,People,People at Leisure,Procession,Retail,Shop,Shops,Uniform",https://penninehorizons.org/files/original/43fd7068e6d79537c10712d57816c66b.jpg,"Still Image","The Making of Todmorden exhibition",1,0
17898,https://penninehorizons.org/items/show/17898,"Brass Band in Hebden Bridge - ALC06325","Albert Street, Boy, Boys, Brass Band, Child, Children, Cobbles, Girl, Girls, Hebden Bridge, Hope Street, Kid, Music, Musical instruments, People, Places, Street Names, Toddler","Playing outside the bank at the junction of Albert Street and Hope Street.",,"Pennine Horizons Digital Archive","Pennine Horizons Digital Archive","No date yet","Ref: 051 Lit & Si - AT609","PHDA - Alice Longstaff Collection","Pennine Horizons Digital Archive","TIFF file 8-bit","English (U.K.)","Documentary photograph",ALC06325.tif,,,,,,,,,,,,,,,,,,,,,,,,,,,,,,,,,,,,"Albert Street,Boy,Brass Band,Child,Children,Cobbles,Girl,Girls,Hebden Bridge,Hope Street,Kid,Music,Musical instruments,People,Street Names,Toddler",https://penninehorizons.org/files/original/18851ba5f89720d9f16624229efd096e.jpg,"Still Image","Alice Longstaff - General Pictures",1,0
16596,https://penninehorizons.org/items/show/16596,"Brass Band in Grounds of Cragg Hall, 1935 - ALC05000","Brass Band, Buildings, Cragg Hall, Cragg Vale, Group, Music, Musical Instrument, People, Places, Uniform","Cragg Vale and Mytholmroyd Public Subscription Band - First appearance in uniform September 1935.",,"Pennine Horizons Digital Archive","Pennine Horizons Digital Archive",1930s,"Formerly V2 P020 Brass Band.","PHDA - Alice Longstaff Collection","Pennine Horizons Digital Archive","TIFF file 8-bit","English (U.K.)","Documentary photograph",ALC05000.TIF,,,,,,,,,,,,,,,,,,,,,,,,,,,,,,,,,,,,"#Cragg Vale,Brass Band,Buildings,Cragg Hall,Cragg Vale,Group,Music,Musical Instrument,People,Uniform",https://penninehorizons.org/files/original/b0414537594b80fe3393685b8f4d8af1.jpg,"Still Image","Alice Longstaff - Group portraits",1,0
17811,https://penninehorizons.org/items/show/17811,"Brass Band - ALC06237","Brass Band, Group, Music, People",,,"Pennine Horizons Digital Archive","Pennine Horizons Digital Archive","No date yet",,"PHDA - Alice Longstaff Collection","Pennine Horizons Digital Archive","TIFF file 8-bit","English (U.K.)","Documentary photograph",ALC06237.tif,,,,,,,,,,,,,,,,,,,,,,,,,,,,,,,,,,,,"Brass Band,Group,Music,People",https://penninehorizons.org/files/original/0978eaa2b6c2dd43da7705b3bf45a4c2.jpg,"Still Image","Alice Longstaff - Group portraits",1,0
13317,https://penninehorizons.org/items/show/13317,"Band in St George's Square, Hebden Bridge - ALC00495","Band, Bicycle, Bridge Mill, Buildings, Chimney, Chimneys, Hebden Bridge, Mill, Mills, Music, Musical Instrument, Places, Road, St Georges Square, Street Names, Transport",,,"Pennine Horizons Digital Archive","Pennine Horizons Digital Archive","No date yet",AT625,"PHDA - Alice Longstaff Collection","Pennine Horizons Digital Archive","TIFF file 8-bit","English (U.K.)","Documentary photograph",ALC00495.tif,,,,,,,,,,,,,,,,,,,,,,,,,,,,,,,,,,,,"Band,Bicycle,Bridge Mill,Buildings,Chimney,Chimneys,Hebden Bridge,Mill,Mills,Music,Musical Instrument,Road,St Georges Square,Street Names,Transport",https://penninehorizons.org/files/original/70e873aab95c37683610a5ac155df719.jpg,"Still Image","Alice Longstaff -  Gallery collection",1,0
