﻿"Item Id","Item URI","Dublin Core:Title","Dublin Core:Subject","Dublin Core:Description","Dublin Core:Creator","Dublin Core:Source","Dublin Core:Publisher","Dublin Core:Date","Dublin Core:Contributor","Dublin Core:Rights","Dublin Core:Relation","Dublin Core:Format","Dublin Core:Language","Dublin Core:Type","Dublin Core:Identifier","Dublin Core:Coverage","Item Type Metadata:Lesson Plan Text","Item Type Metadata:Bibliography","Item Type Metadata:Biographical Text","Item Type Metadata:Occupation","Item Type Metadata:Death Date","Item Type Metadata:Birthplace","Item Type Metadata:Birth Date","Item Type Metadata:Participants","Item Type Metadata:Event Type","Item Type Metadata:URL","Item Type Metadata:Bit Rate/Frequency","Item Type Metadata:Interviewer","Item Type Metadata:Interviewee","Item Type Metadata:Location","Item Type Metadata:Transcription","Item Type Metadata:Local URL","Item Type Metadata:Original Format","Item Type Metadata:Physical Dimensions","Item Type Metadata:Duration","Item Type Metadata:Compression","Item Type Metadata:Producer","Item Type Metadata:Director","Item Type Metadata:Text","Item Type Metadata:Time Summary","Item Type Metadata:Email Body","Item Type Metadata:Subject Line","Item Type Metadata:From","Item Type Metadata:To","Item Type Metadata:CC","Item Type Metadata:BCC","Item Type Metadata:Number of Attachments","Item Type Metadata:Standards","Item Type Metadata:Objectives","Item Type Metadata:Materials",tags,file,itemType,collection,public,featured
10520,https://penninehorizons.org/items/show/10520,"Mons Mill under Construction, 1908 - 9 - MOT00198","Buildings, Chimney, Chimneys, Construction, Crane, Cranes, Mill, Mills, Steam Power","Its founder, Jonathan Gledhill, supervised the cutting of the first sod in June 1907.",,"Todmorden Information Centre Trust","Pennine Horizons Digital Archive",1900s,"Roger Birch","PHDA - Todmorden Information Centre Trust","Pennine Horizons Digital Archive","TIFF file 8-bit","English (U.K.)","Documentary photograph",MOT00198.tif,Todmorden,,,,,,,,,,,,,,,,,,,,,,,,,,,,,,,,,,,"Buildings,Chimney,Chimneys,Construction,Crane,Cranes,Mill,Mills,Steam Power",https://penninehorizons.org/files/original/4b2f534bbef2d6645d5d957517971fec.jpg,"Still Image","The Making of Todmorden exhibition",1,0
10519,https://penninehorizons.org/items/show/10519,"Mons Mill under Construction, 1908 - 9 - MOT00197","Buildings, Construction, Crane, Cranes, Mill, Mills, People, People at Work, Steam Power","The mill's founder, Jonathan Gledhill, supervised the cutting of the first sod in June 1907.",,"Todmorden Information Centre Trust","Pennine Horizons Digital Archive",1900s,"Roger Birch","PHDA - Todmorden Information Centre Trust","Pennine Horizons Digital Archive","TIFF file 8-bit","English (U.K.)","Documentary photograph",MOT00197.tif,Todmorden,,,,,,,,,,,,,,,,,,,,,,,,,,,,,,,,,,,"Buildings,Construction,Crane,Cranes,Mill,Mills,People,People at Work,Steam Power",https://penninehorizons.org/files/original/5c4231468a9f9ce251c2b2f55543bf79.jpg,"Still Image","The Making of Todmorden exhibition",1,0
10469,https://penninehorizons.org/items/show/10469,"Building the 'Great Wall of Todmorden', 1881. - MOT00142","Buildings, Canal, Canals, Crane, Cranes, Dobroyd Castle, People, People at Work, Railway, Railways, Todmorden, Transport","The Lancashire & Yorkshire Railway Company had to build a double retaining wall alongside the canal side at Salford due to land subsidence but also to extend the goods yard.",Unknown,"Todmorden Information Centre Trust","Pennine Horizons Digital Archive","1881, 1880s","Todmorden Information Centre Trust","PHDA - Todmorden Information Centre Trust","Pennine Horizons Digital Archive","TIFF file 8-bit","English (U.K.)","Documentary photograph",MOT00142.tif,Todmorden,,,,,,,,,,,,,,,,,,,,,,,,,,,,,,,,,,,"Buildings,Canal,Crane,Cranes,Dobroyd Castle,People,People at Work,Railway,Railways,Todmorden,Transport",https://penninehorizons.org/files/original/874ab6ca5c417cd720395e1ce6f8add9.jpg,"Still Image","The Making of Todmorden exhibition",1,0
6373,https://penninehorizons.org/items/show/6373,"Flood Prevention Work, Mytholmroyd - HLS01061","Bridge, Bulldozer, County Bridge, Crane, Cranes, Mytholmroyd, Places","Flood prevention work at County Bridge, Mytholmroyd reveals timber foundation of the bridge built 400 years ago.",,,,"No date yet","PH51 - Hebden Bridge Local History Society","PHDA - Hebden Bridge Local History Society","Pennine Horizons Digital Archive","TIFF file 8-bit","English (U.K.)","Documentary photograph",HLS01061.tif,,,,,,,,,,,,,,,,,,,,,,,,,,,,,,,,,,,,"Bridge,Bulldozer,County Bridge,Crane,Cranes,Mytholmroyd",https://penninehorizons.org/files/original/d992c47344195a90804fdfe8915e90e7.jpg,"Still Image","Hebden Bridge Local History Society",1,0
6030,https://penninehorizons.org/items/show/6030,"Construction of Gorple Reservoir, Heptonstall, 1933 - HBC01089 ","Buildings, Construction, Crane, Cranes, People, People at Work, Reservoir, Steam Loco",,Unknown,"Hebden Bridge Camera Club","Pennine Horizons Digital Archive","No date yet","Hebden Bridge Camera Club","PHDA - Hebden Bridge Camera Club","Pennine Horizons Digital Archive","TIFF file 8-bit","English (U.K.)","Documentary photograph",HBC01089.tif,Heptonstall,,,,,,,,,,,,,,,,,,,,,,,,,,,,,,,,,,,"Buildings,Construction,Crane,Cranes,People,People at Work,Reservoir,Steam loco",https://penninehorizons.org/files/original/6486f42124d805f240721e31826ed28f.jpg,"Still Image","Hebden Bridge Camera Club - The Changing Face of Hebden Bridge",1,0
6028,https://penninehorizons.org/items/show/6028,"Construction of Gorple Reservoir, Heptonstall, 1932 - HBC01087 ","Buildings, Construction, Crane, Cranes, People, People at Work, Railway line, Reservoir, Steam Loco",,Unknown,"Hebden Bridge Camera Club","Pennine Horizons Digital Archive","No date yet","Hebden Bridge Camera Club","PHDA - Hebden Bridge Camera Club","Pennine Horizons Digital Archive","TIFF file 8-bit","English (U.K.)","Documentary photograph",HBC01087.tif,Heptonstall,,,,,,,,,,,,,,,,,,,,,,,,,,,,,,,,,,,"Buildings,Construction,Crane,Cranes,People,People at Work,Railway line,Reservoir,Steam loco",https://penninehorizons.org/files/original/aa51baac00f69d713fa92b925ccf3a8c.jpg,"Still Image","Hebden Bridge Camera Club - The Changing Face of Hebden Bridge",1,0
6027,https://penninehorizons.org/items/show/6027,"Construction of Gorple Reservoir, Heptonstall, 1932 - HBC01086 ","Buildings, Construction, Crane, Cranes, People, People at Work, Railway line, Reservoir, Steam Loco",,Unknown,"Hebden Bridge Camera Club","Pennine Horizons Digital Archive","No date yet","Hebden Bridge Camera Club","PHDA - Hebden Bridge Camera Club","Pennine Horizons Digital Archive","TIFF file 8-bit","English (U.K.)","Documentary photograph",HBC01086.tif,Heptonstall,,,,,,,,,,,,,,,,,,,,,,,,,,,,,,,,,,,"Buildings,Construction,Crane,Cranes,People,People at Work,Railway line,Reservoir,Steam loco",https://penninehorizons.org/files/original/aebcb9928ce040e3d7fc85e6a09278a9.jpg,"Still Image","Hebden Bridge Camera Club - The Changing Face of Hebden Bridge",1,0
6026,https://penninehorizons.org/items/show/6026,"Construction of Gorple Reservoir, Heptonstall, 1932 - HBC01085 ","Buildings, Construction, Crane, Cranes, People, People at Work, Railway line, Reservoir, Steam Loco",,Unknown,"Hebden Bridge Camera Club","Pennine Horizons Digital Archive","No date yet","Hebden Bridge Camera Club","PHDA - Hebden Bridge Camera Club","Pennine Horizons Digital Archive","TIFF file 8-bit","English (U.K.)","Documentary photograph",HBC01085.tif,Heptonstall,,,,,,,,,,,,,,,,,,,,,,,,,,,,,,,,,,,"Buildings,Construction,Crane,Cranes,People,People at Work,Railway line,Reservoir,Steam loco",https://penninehorizons.org/files/original/8cf54e97c946bd86c0109b5850c7c538.jpg,"Still Image","Hebden Bridge Camera Club - The Changing Face of Hebden Bridge",1,0
6025,https://penninehorizons.org/items/show/6025,"Construction of Gorple Reservoir, Heptonstall, 1931 - HBC01084 ","Buildings, Construction, Crane, Cranes, People, People at Work, Railway line, Reservoir, Steam Loco",,Unknown,"Hebden Bridge Camera Club","Pennine Horizons Digital Archive","No date yet","Hebden Bridge Camera Club","PHDA - Hebden Bridge Camera Club","Pennine Horizons Digital Archive","TIFF file 8-bit","English (U.K.)","Documentary photograph",HBC01084.tif,Heptonstall,,,,,,,,,,,,,,,,,,,,,,,,,,,,,,,,,,,"Buildings,Construction,Crane,Cranes,People,People at Work,Railway line,Reservoir,Steam loco",https://penninehorizons.org/files/original/e89c5054648101fa55d1c800d37c20ed.jpg,"Still Image","Hebden Bridge Camera Club - The Changing Face of Hebden Bridge",1,0
6024,https://penninehorizons.org/items/show/6024,"Construction of Gorple Reservoir, Heptonstall, 1931 - HBC01083 ","Buildings, Construction, Crane, Cranes, People, People at Work, Railway line, Reservoir, Steam Loco",,Unknown,"Hebden Bridge Camera Club","Pennine Horizons Digital Archive","No date yet","Hebden Bridge Camera Club","PHDA - Hebden Bridge Camera Club","Pennine Horizons Digital Archive","TIFF file 8-bit","English (U.K.)","Documentary photograph",HBC01083.tif,Heptonstall,,,,,,,,,,,,,,,,,,,,,,,,,,,,,,,,,,,"Buildings,Construction,Crane,Cranes,People,People at Work,Railway line,Reservoir,Steam loco",https://penninehorizons.org/files/original/e9d75bd5605549457d711919bce4eac2.jpg,"Still Image","Hebden Bridge Camera Club - The Changing Face of Hebden Bridge",1,0
6023,https://penninehorizons.org/items/show/6023,"Construction of Gorple Reservoir, Heptonstall, 1931 - HBC01082 ","Buildings, Construction, Crane, Cranes, People, People at Work, Reservoir",,Unknown,"Hebden Bridge Camera Club","Pennine Horizons Digital Archive","No date yet","Hebden Bridge Camera Club","PHDA - Hebden Bridge Camera Club","Pennine Horizons Digital Archive","TIFF file 8-bit","English (U.K.)","Documentary photograph",HBC01082.tif,Heptonstall,,,,,,,,,,,,,,,,,,,,,,,,,,,,,,,,,,,"Buildings,Construction,Crane,Cranes,People,People at Work,Reservoir",https://penninehorizons.org/files/original/8c0916d820d3b2b56d94b018e70e1ce9.jpg,"Still Image","Hebden Bridge Camera Club - The Changing Face of Hebden Bridge",1,0
6022,https://penninehorizons.org/items/show/6022,"Construction of Gorple Reservoir, Heptonstall, 1931 - HBC01081 ","Buildings, Construction, Crane, Cranes, People, People at Work, Railway, Railway Wagons, Railway line, Railways, Reservoir, Steam Loco",,Unknown,"Hebden Bridge Camera Club","Pennine Horizons Digital Archive","No date yet","Hebden Bridge Camera Club","PHDA - Hebden Bridge Camera Club","Pennine Horizons Digital Archive","TIFF file 8-bit","English (U.K.)","Documentary photograph",HBC01081.tif,Heptonstall,,,,,,,,,,,,,,,,,,,,,,,,,,,,,,,,,,,"Buildings,Construction,Crane,Cranes,People,People at Work,Railway,Railway line,Railway Wagons,Railways,Reservoir,Steam loco",https://penninehorizons.org/files/original/0e8a28e1434264a79396ca4a888c460d.jpg,"Still Image","Hebden Bridge Camera Club - The Changing Face of Hebden Bridge",1,0
6020,https://penninehorizons.org/items/show/6020,"Construction of Gorple Reservoir, Heptonstall, 1931 - HBC01079 ","Buildings, Construction, Crane, Cranes, People, People at Work, Reservoir",,Unknown,"Hebden Bridge Camera Club","Pennine Horizons Digital Archive","No date yet","Hebden Bridge Camera Club","PHDA - Hebden Bridge Camera Club","Pennine Horizons Digital Archive","TIFF file 8-bit","English (U.K.)","Documentary photograph",HBC01079.tif,Heptonstall,,,,,,,,,,,,,,,,,,,,,,,,,,,,,,,,,,,"Buildings,Construction,Crane,Cranes,People,People at Work,Reservoir",https://penninehorizons.org/files/original/23f5dc38bf0a22a5e7159ea9733fa17c.jpg,"Still Image","Hebden Bridge Camera Club - The Changing Face of Hebden Bridge",1,0
6016,https://penninehorizons.org/items/show/6016,"Construction of Gorple Reservoir, Heptonstall, 1929 - HBC01075 ","Buildings, Construction, Crane, Cranes, Reservoir, Trestle Bridge",,Unknown,"Hebden Bridge Camera Club","Pennine Horizons Digital Archive",1920s,"Hebden Bridge Camera Club","PHDA - Hebden Bridge Camera Club","Pennine Horizons Digital Archive","TIFF file 8-bit","English (U.K.)","Documentary photograph",HBC01075.tif,Heptonstall,,,,,,,,,,,,,,,,,,,,,,,,,,,,,,,,,,,"Buildings,Construction,Crane,Cranes,Reservoir,Trestle Bridge",https://penninehorizons.org/files/original/b996910c7915ff1c213730d900d6a419.jpg,"Still Image","Hebden Bridge Camera Club - The Changing Face of Hebden Bridge",1,0
6014,https://penninehorizons.org/items/show/6014,"Construction of Gorple Reservoir, Heptonstall, 1929 - HBC01073 ","Buildings, Construction, Crane, Cranes, People, People at Work, Railway, Railway Wagons, Railway line, Railways",,Unknown,"Hebden Bridge Camera Club","Pennine Horizons Digital Archive",1920s,"Hebden Bridge Camera Club","PHDA - Hebden Bridge Camera Club","Pennine Horizons Digital Archive","TIFF file 8-bit","English (U.K.)","Documentary photograph",HBC01073.tif,Heptonstall,,,,,,,,,,,,,,,,,,,,,,,,,,,,,,,,,,,"Buildings,Construction,Crane,Cranes,People,People at Work,Railway,Railway line,Railway Wagons,Railways",https://penninehorizons.org/files/original/cb202f779207a9310125b1f8ffa76c30.jpg,"Still Image","Hebden Bridge Camera Club - The Changing Face of Hebden Bridge",1,0
6007,https://penninehorizons.org/items/show/6007,"Construction of Gorple Reservoir, Heptonstall, 1928 - HBC01066 ","Buildings, Construction, Crane, Cranes, Reservoir",,Unknown,"Hebden Bridge Camera Club","Pennine Horizons Digital Archive",1920s,"Hebden Bridge Camera Club","PHDA - Hebden Bridge Camera Club","Pennine Horizons Digital Archive","TIFF file 8-bit","English (U.K.)","Documentary photograph",HBC01066.tif,Heptonstall,,,,,,,,,,,,,,,,,,,,,,,,,,,,,,,,,,,"Buildings,Construction,Crane,Cranes,Reservoir",https://penninehorizons.org/files/original/04af0c07d497f23aa54f07605ce2794a.jpg,"Still Image","Hebden Bridge Camera Club - The Changing Face of Hebden Bridge",1,0
6006,https://penninehorizons.org/items/show/6006,"Construction of Gorple Reservoir, Heptonstall, 1928 - HBC01065 ","Buildings, Cement mixer, Construction, Crane, Cranes, People, People at Work, Reservoir",,Unknown,"Hebden Bridge Camera Club","Pennine Horizons Digital Archive",1920s,"Hebden Bridge Camera Club","PHDA - Hebden Bridge Camera Club","Pennine Horizons Digital Archive","TIFF file 8-bit","English (U.K.)","Documentary photograph",HBC01065.tif,Heptonstall,,,,,,,,,,,,,,,,,,,,,,,,,,,,,,,,,,,"Buildings,Cement mixer,Construction,Crane,Cranes,People,People at Work,Reservoir",https://penninehorizons.org/files/original/f9a713bb902880af8eb2be2ef66659fd.jpg,"Still Image","Hebden Bridge Camera Club - The Changing Face of Hebden Bridge",1,0
6005,https://penninehorizons.org/items/show/6005,"Construction of Gorple Reservoir, Heptonstall, 1928 - HBC01064 ","Buildings, Construction, Crane, Cranes, People, People at Work, Reservoir","Gorple Lower Reservoir looking south. 10.4.28",Unknown,"Hebden Bridge Camera Club","Pennine Horizons Digital Archive",1920s,"Hebden Bridge Camera Club","PHDA - Hebden Bridge Camera Club","Pennine Horizons Digital Archive","TIFF file 8-bit","English (U.K.)","Documentary photograph",HBC01064.tif,Heptonstall,,,,,,,,,,,,,,,,,,,,,,,,,,,,,,,,,,,"Buildings,Construction,Crane,Cranes,People,People at Work,Reservoir",https://penninehorizons.org/files/original/4d566ecb6f42a479265c4c910b18411c.jpg,"Still Image","Hebden Bridge Camera Club - The Changing Face of Hebden Bridge",1,0
6004,https://penninehorizons.org/items/show/6004,"Construction of Gorple Reservoir, Heptonstall, 1928 - HBC01063 ","Buildings, Construction, Crane, Cranes, People, People at Work, Railway, Railway Wagons, Railway line, Railways, Reservoir","Gorple Lower Reservoir looking north. 10.4.28",Unknown,"Hebden Bridge Camera Club","Pennine Horizons Digital Archive",1920s,"Hebden Bridge Camera Club","PHDA - Hebden Bridge Camera Club","Pennine Horizons Digital Archive","TIFF file 8-bit","English (U.K.)","Documentary photograph",HBC01063.tif,Heptonstall,,,,,,,,,,,,,,,,,,,,,,,,,,,,,,,,,,,"Buildings,Construction,Crane,Cranes,People,People at Work,Railway,Railway line,Railway Wagons,Railways,Reservoir",https://penninehorizons.org/files/original/59bff76a84077d4145bccc42238c261a.jpg,"Still Image","Hebden Bridge Camera Club - The Changing Face of Hebden Bridge",1,0
6003,https://penninehorizons.org/items/show/6003,"Construction of Gorple Reservoir, Heptonstall, 1928 - HBC01062 ","Buildings, Construction, Crane, Cranes, People, People at Work, Railway, Railway Wagons, Railway line, Railways, Reservoir",,Unknown,"Hebden Bridge Camera Club","Pennine Horizons Digital Archive",1920s,"Hebden Bridge Camera Club","PHDA - Hebden Bridge Camera Club","Pennine Horizons Digital Archive","TIFF file 8-bit","English (U.K.)","Documentary photograph",HBC01062.tif,Heptonstall,,,,,,,,,,,,,,,,,,,,,,,,,,,,,,,,,,,"Buildings,Construction,Crane,Cranes,People,People at Work,Railway,Railway line,Railway Wagons,Railways,Reservoir",https://penninehorizons.org/files/original/981419fd5002dfb550c6c06ed2f3d825.jpg,"Still Image","Hebden Bridge Camera Club - The Changing Face of Hebden Bridge",1,0
6002,https://penninehorizons.org/items/show/6002,"Construction of Gorple Reservoir, Heptonstall, 1928 - HBC01061 ","Buildings, Construction, Crane, Cranes, People, People at Work, Reservoir",,Unknown,"Hebden Bridge Camera Club","Pennine Horizons Digital Archive",1920s,"Hebden Bridge Camera Club","PHDA - Hebden Bridge Camera Club","Pennine Horizons Digital Archive","TIFF file 8-bit","English (U.K.)","Documentary photograph",HBC01061.tif,Heptonstall,,,,,,,,,,,,,,,,,,,,,,,,,,,,,,,,,,,"Buildings,Construction,Crane,Cranes,People,People at Work,Reservoir",https://penninehorizons.org/files/original/de12c63fbb1342cb2f2d82258196b48c.jpg,"Still Image","Hebden Bridge Camera Club - The Changing Face of Hebden Bridge",1,0
6000,https://penninehorizons.org/items/show/6000,"Construction of Gorple Reservoir, Heptonstall, 1928 - HBC01059 ","Buildings, Construction, Crane, Cranes, People, People at Work, Reservoir","Upper Gorple reservoir from the middle looking North. Lower Gorple is to the right. You can see the bottom of the Blondin tower on the centre line and only Upper reservoir had one.",Unknown,"Hebden Bridge Camera Club","Pennine Horizons Digital Archive",1920s,"Hebden Bridge Camera Club","PHDA - Hebden Bridge Camera Club","Pennine Horizons Digital Archive","TIFF file 8-bit","English (U.K.)","Documentary photograph",HBC01059.tif,Heptonstall,,,,,,,,,,,,,,,,,,,,,,,,,,,,,,,,,,,"Buildings,Construction,Crane,Cranes,People,People at Work,Reservoir",https://penninehorizons.org/files/original/c339c3d3d8a4233a17b1db58cbb7be1c.jpg,"Still Image","Hebden Bridge Camera Club - The Changing Face of Hebden Bridge",1,0
5999,https://penninehorizons.org/items/show/5999,"Construction of Gorple Reservoir, Heptonstall, 1928 - HBC01058 ","Buildings, Construction, Crane, Cranes, People, People at Work, Railway, Railway Wagons, Railway line, Railways, Reservoir",,Unknown,"Hebden Bridge Camera Club","Pennine Horizons Digital Archive",1920s,"Hebden Bridge Camera Club","PHDA - Hebden Bridge Camera Club","Pennine Horizons Digital Archive","TIFF file 8-bit","English (U.K.)","Documentary photograph",HBC01058.tif,Heptonstall,,,,,,,,,,,,,,,,,,,,,,,,,,,,,,,,,,,"Buildings,Construction,Crane,Cranes,People,People at Work,Railway,Railway line,Railway Wagons,Railways,Reservoir",https://penninehorizons.org/files/original/e96cab539d4dfc1f4a21181b8056c858.jpg,"Still Image","Hebden Bridge Camera Club - The Changing Face of Hebden Bridge",1,0
5997,https://penninehorizons.org/items/show/5997,"Canal Wharf Mill, Hawksclough, Mytholmroyd - HBC01056 ","Chimney, Chimneys, Clog Maker, Crane, Cranes, Mill, Mytholmroyd, People, Places",,"J. Woodhead","Hebden Bridge Camera Club","Pennine Horizons Digital Archive","No date yet","Hebden Bridge Camera Club","PHDA - Hebden Bridge Camera Club","Pennine Horizons Digital Archive","TIFF file 8-bit","English (U.K.)","Documentary photograph",HBC01056.tif,,,,,,,,,,,,,,,,,,,,,,,,,,,,,,,,,,,,"Chimney,Chimneys,Clog Maker,Crane,Cranes,Mill,Mytholmroyd,People",https://penninehorizons.org/files/original/be4b2db41032eacd4fb4cace8b9d6e13.jpg,"Still Image","Hebden Bridge Camera Club - The Changing Face of Hebden Bridge",1,0
5988,https://penninehorizons.org/items/show/5988,"Mytholm Close Flats, Hebden Bridge, 2004 - HBC01047 ","Bankfoot, Buildings, Cement mixer, Construction, Crane, Cranes, Hebden Bridge, Housing, Places",,"K. Green","Hebden Bridge Camera Club","Pennine Horizons Digital Archive","No date yet","Hebden Bridge Camera Club","PHDA - Hebden Bridge Camera Club","Pennine Horizons Digital Archive","TIFF file 8-bit","English (U.K.)","Documentary photograph",HBC01047.tif,,,,,,,,,,,,,,,,,,,,,,,,,,,,,,,,,,,,"Bankfoot,Buildings,Cement mixer,Construction,Crane,Cranes,Hebden Bridge,Housing",https://penninehorizons.org/files/original/72eda582fca2ae8f465c6913e0cd4875.jpg,"Still Image","Hebden Bridge Camera Club - The Changing Face of Hebden Bridge",1,0
