﻿"Item Id","Item URI","Dublin Core:Title","Dublin Core:Subject","Dublin Core:Description","Dublin Core:Creator","Dublin Core:Source","Dublin Core:Publisher","Dublin Core:Date","Dublin Core:Contributor","Dublin Core:Rights","Dublin Core:Relation","Dublin Core:Format","Dublin Core:Language","Dublin Core:Type","Dublin Core:Identifier","Dublin Core:Coverage","Item Type Metadata:Lesson Plan Text","Item Type Metadata:Bibliography","Item Type Metadata:Biographical Text","Item Type Metadata:Occupation","Item Type Metadata:Death Date","Item Type Metadata:Birthplace","Item Type Metadata:Birth Date","Item Type Metadata:Participants","Item Type Metadata:Event Type","Item Type Metadata:URL","Item Type Metadata:Bit Rate/Frequency","Item Type Metadata:Interviewer","Item Type Metadata:Interviewee","Item Type Metadata:Location","Item Type Metadata:Transcription","Item Type Metadata:Local URL","Item Type Metadata:Original Format","Item Type Metadata:Physical Dimensions","Item Type Metadata:Duration","Item Type Metadata:Compression","Item Type Metadata:Producer","Item Type Metadata:Director","Item Type Metadata:Text","Item Type Metadata:Time Summary","Item Type Metadata:Email Body","Item Type Metadata:Subject Line","Item Type Metadata:From","Item Type Metadata:To","Item Type Metadata:CC","Item Type Metadata:BCC","Item Type Metadata:Number of Attachments","Item Type Metadata:Standards","Item Type Metadata:Objectives","Item Type Metadata:Materials",tags,file,itemType,collection,public,featured
4397,https://penninehorizons.org/items/show/4397,"Secretly Pleased by Square Peg Productions - DMC00114","Actress, Colden, Female, Name, People, Places, Woman, Women","A play based on the life of Alice Longstaff, written by Anna Carlisle and performed in July 2007 by Alexandra Mathie and Robert Garrett in the beautiful setting of Land Farm Garden at Colden.","David Martin","Pennine Horizons Digital Archive","Pennine Horizons Digital Archive","No date yet","David Martin","PHDA - David Martin Collection","Pennine Horizons Digital Archive","TIFF file 8-bit","English (U.K.)","Documentary photograph",DMC00114.tif,",  ",,,,,,,,,,,,,,,,,,,,,,,,,,,,,,,,,,,"Actress,Colden,Female,Name,People,Woman,Women",https://penninehorizons.org/files/original/ecb5dd216331c5ae5747b92464145e97.jpg,"Still Image","David's Own Pictures",1,0
9992,https://penninehorizons.org/items/show/9992," - LLG00705","Female, People, Portrait, Studio, Woman, Women","Carte de Visite","Davis & Son Halifax","Pennine Horizons Digital Archive","Pennine Horizons Digital Archive","No date yet",,"PHDA - Lloyd Greenwood Collection","Pennine Horizons Digital Archive","TIFF file 8-bit","English (U.K.)","Documentary photograph",LLG00705.tif,,,,,,,,,,,,,,,,,,,,,,,,,,,,,,,,,,,,"Female,People,Portrait,Studio,Woman,Women",https://penninehorizons.org/files/original/4a4ceb8ed7ac804170abe113eca179e6.jpg,"Still Image","Lloyd Greenwood collection",1,0
9981,https://penninehorizons.org/items/show/9981," - LLG00694","Female, People, Portrait, Studio, Woman, Women","Carte de Visite","E Clapham Todmorden","Pennine Horizons Digital Archive","Pennine Horizons Digital Archive","No date yet",,"PHDA - Lloyd Greenwood Collection","Pennine Horizons Digital Archive","TIFF file 8-bit","English (U.K.)","Documentary photograph",LLG00694.tif,,,,,,,,,,,,,,,,,,,,,,,,,,,,,,,,,,,,"Female,People,Portrait,Studio,Woman,Women",https://penninehorizons.org/files/original/c793f1c97ab5ecc703b4b5050bb89402.jpg,"Still Image","Lloyd Greenwood collection",1,0
9989,https://penninehorizons.org/items/show/9989," - LLG00702","Female, People, Portrait, Studio, Woman, Women","Carte de Visite","E Clapham Todmorden","Pennine Horizons Digital Archive","Pennine Horizons Digital Archive","No date yet",,"PHDA - Lloyd Greenwood Collection","Pennine Horizons Digital Archive","TIFF file 8-bit","English (U.K.)","Documentary photograph",LLG00702.tif,,,,,,,,,,,,,,,,,,,,,,,,,,,,,,,,,,,,"Female,People,Portrait,Studio,Woman,Women",https://penninehorizons.org/files/original/6dcac76b754c52189605ad14693fae1a.jpg,"Still Image","Lloyd Greenwood collection",1,0
9907,https://penninehorizons.org/items/show/9907,"White Pom Poms - LLG00620","Female, Group, Male, People, Studio, Woman, Women","Entertainment troop","E Illingworth","Pennine Horizons Digital Archive","Pennine Horizons Digital Archive","No date yet",,"PHDA - Lloyd Greenwood Collection","Pennine Horizons Digital Archive","TIFF file 8-bit","English (U.K.)","Documentary photograph",LLG00620.tif,,,,,,,,,,,,,,,,,,,,,,,,,,,,,,,,,,,,"Female,Group,Male,People,Studio,Woman,Women",https://penninehorizons.org/files/original/95cd4e6220d4edd62e820a1c4b1723ab.jpg,"Still Image","Lloyd Greenwood collection",1,0
12069,https://penninehorizons.org/items/show/12069,"Female Portrait - ALC03631","Female, Female_portrait, People, Portrait, Woman, Women",,"E. Greaves, Halifax","Pennine Horizons Digital Archive","Pennine Horizons Digital Archive","No date yet",,"PHDA - Alice Longstaff Collection","Pennine Horizons Digital Archive","TIFF file 8-bit","English (U.K.)","Documentary photograph",ALC03631.tif,,,,,,,,,,,,,,,,,,,,,,,,,,,,,,,,,,,,"Female,Female_portrait,People,Portrait,Woman,Women",https://penninehorizons.org/files/original/8be5477aa2c13269af3bad34e78cb21d.jpg,"Still Image","Alice Longstaff - Female portraits",1,0
12693,https://penninehorizons.org/items/show/12693,"Portrait of a lady - ALC04357","Female, Female_portrait, People, Portrait, Studio, Woman, Women",,"Greaves, huddersfield","Pennine Horizons Digital Archive","Pennine Horizons Digital Archive","No date yet",,"PHDA - Alice Longstaff Collection","Pennine Horizons Digital Archive","TIFF file 8-bit","English (U.K.)","Documentary photograph",ALC04357.tif,,,,,,,,,,,,,,,,,,,,,,,,,,,,,,,,,,,,"Female,Female_portrait,People,Portrait,Studio,Woman,Women",https://penninehorizons.org/files/original/d64097465702fec5bb9e622a2670b259.jpg,"Still Image","Alice Longstaff - Female portraits",1,0
9978,https://penninehorizons.org/items/show/9978," - LLG00691","Female, People, Portrait, Studio, Woman, Women","Carte de Visite","J Brooks Todmorden","Pennine Horizons Digital Archive","Pennine Horizons Digital Archive","No date yet",,"PHDA - Lloyd Greenwood Collection","Pennine Horizons Digital Archive","TIFF file 8-bit","English (U.K.)","Documentary photograph",LLG00691.tif,,,,,,,,,,,,,,,,,,,,,,,,,,,,,,,,,,,,"Female,People,Portrait,Studio,Woman,Women",https://penninehorizons.org/files/original/aa72c01223fd14155bc64bdb330d74e4.jpg,"Still Image","Lloyd Greenwood collection",1,0
9990,https://penninehorizons.org/items/show/9990," - LLG00703","Female, People, Portrait, Studio, Woman, Women","Carte de Visite","J Brooks Todmorden","Pennine Horizons Digital Archive","Pennine Horizons Digital Archive","No date yet",,"PHDA - Lloyd Greenwood Collection","Pennine Horizons Digital Archive","TIFF file 8-bit","English (U.K.)","Documentary photograph",LLG00703.tif,,,,,,,,,,,,,,,,,,,,,,,,,,,,,,,,,,,,"Female,People,Portrait,Studio,Woman,Women",https://penninehorizons.org/files/original/66200d1bac7e7796cbc56cb20de8f4e9.jpg,"Still Image","Lloyd Greenwood collection",1,0
9991,https://penninehorizons.org/items/show/9991," - LLG00704","Female, People, Portrait, Studio, Woman, Women","Carte de Visite","J Brooks Todmorden","Pennine Horizons Digital Archive","Pennine Horizons Digital Archive","No date yet",,"PHDA - Lloyd Greenwood Collection","Pennine Horizons Digital Archive","TIFF file 8-bit","English (U.K.)","Documentary photograph",LLG00704.tif,,,,,,,,,,,,,,,,,,,,,,,,,,,,,,,,,,,,"Female,People,Portrait,Studio,Woman,Women",https://penninehorizons.org/files/original/36b03632c7e5ed49ade643efdd67c523.jpg,"Still Image","Lloyd Greenwood collection",1,0
9993,https://penninehorizons.org/items/show/9993," - LLG00706","Female, People, Portrait, Studio, Woman, Women","Carte de Visite","J Brooks Todmorden","Pennine Horizons Digital Archive","Pennine Horizons Digital Archive","No date yet",,"PHDA - Lloyd Greenwood Collection","Pennine Horizons Digital Archive","TIFF file 8-bit","English (U.K.)","Documentary photograph",LLG00706.tif,,,,,,,,,,,,,,,,,,,,,,,,,,,,,,,,,,,,"Female,People,Portrait,Studio,Woman,Women",https://penninehorizons.org/files/original/ec994b84123b834d77b687d60053cd52.jpg,"Still Image","Lloyd Greenwood collection",1,0
18563,https://penninehorizons.org/items/show/18563,"Elizabeth Ashworth - JET00145","Baby, Female, People, Portrait, Woman, Women",,"J. Brooks, Wellington Road, Todmorden","Pennine Horizons Digital Archive","Pennine Horizons Digital Archive","No date yet","Jeanette Thomas","PHDA - Jeanette Thomas Collection","Pennine Horizons Digital Archive","TIFF file 8-bit","English (U.K.)","Documentary photograph",JET00145.tif,,,,,,,,,,,,,,,,,,,,,,,,,,,,,,,,,,,,"Baby,Female,People,Portrait,Woman,Women",https://penninehorizons.org/files/original/ba8b4a830af0749bc4bdda606bab1ed4.jpg,"Still Image","Jeanette Thomas collection",1,0
10000,https://penninehorizons.org/items/show/10000," - LLG00713","Female, People, Portrait, Studio, Woman, Women",,"James Brooks, Todmorden","Pennine Horizons Digital Archive","Pennine Horizons Digital Archive","No date yet",,"PHDA - Lloyd Greenwood Collection","Pennine Horizons Digital Archive","TIFF file 8-bit","English (U.K.)","Documentary photograph",LLG00713.tif,,,,,,,,,,,,,,,,,,,,,,,,,,,,,,,,,,,,"Female,People,Portrait,Studio,Woman,Women",https://penninehorizons.org/files/original/69c576866316c96ca21b9786725873b3.jpg,"Still Image","Lloyd Greenwood collection",1,0
10320,https://penninehorizons.org/items/show/10320,"Female Portrait - LLG001035","Female, Portrait",,"James Brooks, Todmorden","Pennine Horizons Digital Archive","Pennine Horizons Digital Archive","No date yet","Lloyd Greenwood","PHDA - Lloyd Greenwood Collection","Pennine Horizons Digital Archive","TIFF file 8-bit","English (U.K.)","Documentary photograph",LLG001035.tif,,,,,,,,,,,,,,,,,,,,,,,,,,,,,,,,,,,,Female,https://penninehorizons.org/files/original/500402b2c7ca9bd1d9cec5b00fccbbc9.jpg,"Still Image","Lloyd Greenwood collection",1,0
21845,https://penninehorizons.org/items/show/21845,"Viv Boardman - JAE00102","Female, Hebden Bridge 500 faces, People, Portrait, Woman, Women",c.2009,"Jason Elliott","Hebden Royd Town Council","Pennine Horizons Digital Archive",2008-08-24T14:21:19+01:00,"Jason Elliott","PHDA - Jason Elliott Collection","Pennine Horizons Digital Archive","TIFF file 8-bit","English (U.K.)","Documentary photograph",JAE00102.tif,,,,,,,,,,,,,,,,,,,,,,,,,,,,,,,,,,,,"Female,Hebden Bridge 500 faces,People,Portrait,Woman,Women",https://penninehorizons.org/files/original/f90da555c156a685d31a0feaa1fd2105.jpg,"Still Image","Jason Elliott Collection - 500 Faces of Hebden Bridge",1,0
21847,https://penninehorizons.org/items/show/21847,"Lucy Tatum - JAE00104","Female, Hebden Bridge 500 faces, People, Portrait, Woman, Women",c.2009,"Jason Elliott","Hebden Royd Town Council","Pennine Horizons Digital Archive",2008-08-26T10:00:18+01:00,"Jason Elliott","PHDA - Jason Elliott Collection","Pennine Horizons Digital Archive","TIFF file 8-bit","English (U.K.)","Documentary photograph",JAE00104.tif,,,,,,,,,,,,,,,,,,,,,,,,,,,,,,,,,,,,"Female,Hebden Bridge 500 faces,People,Portrait,Woman,Women",https://penninehorizons.org/files/original/cb42a9bb16a5e758820f03295019228f.jpg,"Still Image","Jason Elliott Collection - 500 Faces of Hebden Bridge",1,0
21849,https://penninehorizons.org/items/show/21849,"Abby Lowe - JAE00106","Female, Hebden Bridge 500 faces, People, Portrait, Woman, Women",c.2009,"Jason Elliott","Hebden Royd Town Council","Pennine Horizons Digital Archive",2008-08-27T04:48:42+01:00,"Jason Elliott","PHDA - Jason Elliott Collection","Pennine Horizons Digital Archive","TIFF file 8-bit","English (U.K.)","Documentary photograph",JAE00106.tif,,,,,,,,,,,,,,,,,,,,,,,,,,,,,,,,,,,,"Female,Hebden Bridge 500 faces,People,Portrait,Woman,Women",https://penninehorizons.org/files/original/1b8c87b4b66a3f17a64c1545996d95f0.jpg,"Still Image","Jason Elliott Collection - 500 Faces of Hebden Bridge",1,0
21853,https://penninehorizons.org/items/show/21853,"Louisa Clarkson - JAE00110","Female, Hebden Bridge 500 faces, People, People at Work, Portrait, Woman, Women",c.2009,"Jason Elliott","Hebden Royd Town Council","Pennine Horizons Digital Archive",2008-08-27T14:17:05+01:00,"Jason Elliott","PHDA - Jason Elliott Collection","Pennine Horizons Digital Archive","TIFF file 8-bit","English (U.K.)","Documentary photograph",JAE00110.tif,,,,,,,,,,,,,,,,,,,,,,,,,,,,,,,,,,,,"Female,Hebden Bridge 500 faces,People,People at Work,Portrait,Woman,Women",https://penninehorizons.org/files/original/6460a88e8bf1752021966a4713c9b62d.jpg,"Still Image","Jason Elliott Collection - 500 Faces of Hebden Bridge",1,0
21856,https://penninehorizons.org/items/show/21856,"Rachael Smith - JAE00113","Female, Hebden Bridge 500 faces, People, Portrait, Woman, Women",c.2009,"Jason Elliott","Hebden Royd Town Council","Pennine Horizons Digital Archive",2008-08-29T05:00:16+01:00,"Jason Elliott","PHDA - Jason Elliott Collection","Pennine Horizons Digital Archive","TIFF file 8-bit","English (U.K.)","Documentary photograph",JAE00113.tif,,,,,,,,,,,,,,,,,,,,,,,,,,,,,,,,,,,,"Female,Hebden Bridge 500 faces,People,Portrait,Woman,Women",https://penninehorizons.org/files/original/f3678aa5e07f5a786058508c48c7d474.jpg,"Still Image","Jason Elliott Collection - 500 Faces of Hebden Bridge",1,0
21857,https://penninehorizons.org/items/show/21857,"Leif Carr-Smith - JAE00114","Children, Female, Hebden Bridge 500 faces, People, Portrait, Woman, Women",c.2009,"Jason Elliott","Hebden Royd Town Council","Pennine Horizons Digital Archive",2008-08-29T05:08:41+01:00,"Jason Elliott","PHDA - Jason Elliott Collection","Pennine Horizons Digital Archive","TIFF file 8-bit","English (U.K.)","Documentary photograph",JAE00114.tif,,,,,,,,,,,,,,,,,,,,,,,,,,,,,,,,,,,,"Children,Female,Hebden Bridge 500 faces,People,Portrait,Woman,Women",https://penninehorizons.org/files/original/1a35517fac29de028d6e7e1541803f18.jpg,"Still Image","Jason Elliott Collection - 500 Faces of Hebden Bridge",1,0
21858,https://penninehorizons.org/items/show/21858,"Cayenne Egdell - JAE00115","Female, Hebden Bridge 500 faces, People, Portrait, Woman, Women",c.2009,"Jason Elliott","Hebden Royd Town Council","Pennine Horizons Digital Archive",2008-08-31T09:59:40+01:00,"Jason Elliott","PHDA - Jason Elliott Collection","Pennine Horizons Digital Archive","TIFF file 8-bit","English (U.K.)","Documentary photograph",JAE00115.tif,,,,,,,,,,,,,,,,,,,,,,,,,,,,,,,,,,,,"Female,Hebden Bridge 500 faces,People,Portrait,Woman,Women",https://penninehorizons.org/files/original/c266ebdc30897f3b026c060ab685d715.jpg,"Still Image","Jason Elliott Collection - 500 Faces of Hebden Bridge",1,0
21859,https://penninehorizons.org/items/show/21859,"Margaret Beaumont - JAE00116","Female, Hebden Bridge 500 faces, People, Portrait, Woman, Women","Pictured in what was the Arts Festival shop on Albert Street. c.2009","Jason Elliott","Hebden Royd Town Council","Pennine Horizons Digital Archive",2008-08-31T10:16:49+01:00,"Jason Elliott","PHDA - Jason Elliott Collection","Pennine Horizons Digital Archive","TIFF file 8-bit","English (U.K.)","Documentary photograph",JAE00116.tif,,,,,,,,,,,,,,,,,,,,,,,,,,,,,,,,,,,,"Female,Hebden Bridge 500 faces,People,Portrait,Woman,Women",https://penninehorizons.org/files/original/124c1f15c65e714610082b499b77ac46.jpg,"Still Image","Jason Elliott Collection - 500 Faces of Hebden Bridge",1,0
21864,https://penninehorizons.org/items/show/21864,"Helen Griffin - JAE00121","Female, Hebden Bridge 500 faces, People, Portrait, Woman, Women",c.2009,"Jason Elliott","Hebden Royd Town Council","Pennine Horizons Digital Archive",2008-09-04T12:40:05+01:00,"Jason Elliott","PHDA - Jason Elliott Collection","Pennine Horizons Digital Archive","TIFF file 8-bit","English (U.K.)","Documentary photograph",JAE00121.tif,,,,,,,,,,,,,,,,,,,,,,,,,,,,,,,,,,,,"Female,Hebden Bridge 500 faces,People,Portrait,Woman,Women",https://penninehorizons.org/files/original/a21dcb827e95ff20edb242ed86fa11c0.jpg,"Still Image","Jason Elliott Collection - 500 Faces of Hebden Bridge",1,0
21865,https://penninehorizons.org/items/show/21865,"Patti Hufton - JAE00122","Female, Hebden Bridge 500 faces, People, Portrait, Woman, Women",c.2009,"Jason Elliott","Hebden Royd Town Council","Pennine Horizons Digital Archive",2008-09-04T12:47:58+01:00,"Jason Elliott","PHDA - Jason Elliott Collection","Pennine Horizons Digital Archive","TIFF file 8-bit","English (U.K.)","Documentary photograph",JAE00122.tif,,,,,,,,,,,,,,,,,,,,,,,,,,,,,,,,,,,,"Female,Hebden Bridge 500 faces,People,Portrait,Woman,Women",https://penninehorizons.org/files/original/092471974fa345a47b9084b326a5f8dc.jpg,"Still Image","Jason Elliott Collection - 500 Faces of Hebden Bridge",1,0
21866,https://penninehorizons.org/items/show/21866,"Pauline Law - JAE00123","Female, Hebden Bridge 500 faces, People, People at Work, Portrait, Woman, Women","Pauline worked at the White Lion, Hebden Bridge. c.2009","Jason Elliott","Hebden Royd Town Council","Pennine Horizons Digital Archive",2008-09-04T12:52:57+01:00,"Jason Elliott","PHDA - Jason Elliott Collection","Pennine Horizons Digital Archive","TIFF file 8-bit","English (U.K.)","Documentary photograph",JAE00123.tif,,,,,,,,,,,,,,,,,,,,,,,,,,,,,,,,,,,,"Female,Hebden Bridge 500 faces,People,People at Work,Portrait,Woman,Women",https://penninehorizons.org/files/original/9614952a65d6974a2a4c1d853a57d590.jpg,"Still Image","Jason Elliott Collection - 500 Faces of Hebden Bridge",1,0
