﻿"Item Id","Item URI","Dublin Core:Title","Dublin Core:Subject","Dublin Core:Description","Dublin Core:Creator","Dublin Core:Source","Dublin Core:Publisher","Dublin Core:Date","Dublin Core:Contributor","Dublin Core:Rights","Dublin Core:Relation","Dublin Core:Format","Dublin Core:Language","Dublin Core:Type","Dublin Core:Identifier","Dublin Core:Coverage","Item Type Metadata:Lesson Plan Text","Item Type Metadata:Bibliography","Item Type Metadata:Biographical Text","Item Type Metadata:Occupation","Item Type Metadata:Death Date","Item Type Metadata:Birthplace","Item Type Metadata:Birth Date","Item Type Metadata:Participants","Item Type Metadata:Event Type","Item Type Metadata:URL","Item Type Metadata:Bit Rate/Frequency","Item Type Metadata:Interviewer","Item Type Metadata:Interviewee","Item Type Metadata:Location","Item Type Metadata:Transcription","Item Type Metadata:Local URL","Item Type Metadata:Original Format","Item Type Metadata:Physical Dimensions","Item Type Metadata:Duration","Item Type Metadata:Compression","Item Type Metadata:Producer","Item Type Metadata:Director","Item Type Metadata:Text","Item Type Metadata:Time Summary","Item Type Metadata:Email Body","Item Type Metadata:Subject Line","Item Type Metadata:From","Item Type Metadata:To","Item Type Metadata:CC","Item Type Metadata:BCC","Item Type Metadata:Number of Attachments","Item Type Metadata:Standards","Item Type Metadata:Objectives","Item Type Metadata:Materials",tags,file,itemType,collection,public,featured
6453,https://penninehorizons.org/items/show/6453,"Carlton Hotel.  Hebden Bridge - HLS01163","Carlton Hotel, Hebden Bridge, Places, Public Houses, Pubs Inns & Hotels, Taverns","Bar area.",,,,"No date yet","PH78 - Hebden Bridge Local History Society","PHDA - Hebden Bridge Local History Society","Pennine Horizons Digital Archive","TIFF file 8-bit","English (U.K.)","Documentary photograph",HLS01163.tif,,,,,,,,,,,,,,,,,,,,,,,,,,,,,,,,,,,,"Carlton Hotel,Hebden Bridge,Public Houses,Pubs Inns and Hotels,Taverns",https://penninehorizons.org/files/original/beeb95f33601a2d34dfaba502c58e58c.jpg,"Still Image","Hebden Bridge Local History Society",1,0
6454,https://penninehorizons.org/items/show/6454,"Carlton Hotel.  Hebden Bridge - HLS01164","Carlton Hotel, Group, Hebden Bridge, People, Places, Public Houses, Pubs Inns & Hotels, Taverns","Can anyone identify these elegantly dressed people?",,,,"No date yet",,"PHDA - Hebden Bridge Local History Society","Pennine Horizons Digital Archive","TIFF file 8-bit","English (U.K.)","Documentary photograph",HLS01164.tif,,,,,,,,,,,,,,,,,,,,,,,,,,,,,,,,,,,,"Carlton Hotel,Group,Hebden Bridge,People,Public Houses,Pubs Inns and Hotels,Taverns",https://penninehorizons.org/files/original/1e1869b94c83851cb86f12621791be9e.jpg,"Still Image","Hebden Bridge Local History Society",1,0
6455,https://penninehorizons.org/items/show/6455,"Carlton Hotel.  Hebden Bridge - HLS01165","Carlton Hotel, Hebden Bridge, Places, Public Houses, Pubs Inns & Hotels, Taverns","Function Room.",,,,"No date yet","PH78 - Hebden Bridge Local History Society","PHDA - Hebden Bridge Local History Society","Pennine Horizons Digital Archive","TIFF file 8-bit","English (U.K.)","Documentary photograph",HLS01165.tif,,,,,,,,,,,,,,,,,,,,,,,,,,,,,,,,,,,,"Carlton Hotel,Hebden Bridge,Public Houses,Pubs Inns and Hotels,Taverns",https://penninehorizons.org/files/original/b9986ecc0def417cadc65d3c9b8657c4.jpg,"Still Image","Hebden Bridge Local History Society",1,0
6456,https://penninehorizons.org/items/show/6456,"Carlton Hotel.  Hebden Bridge - HLS01166","Carlton Hotel, Hebden Bridge, Places, Public Houses, Pubs Inns & Hotels, Taverns","Dining Room",,,,"No date yet","PH78 - Hebden Bridge Local History Society","PHDA - Hebden Bridge Local History Society","Pennine Horizons Digital Archive","TIFF file 8-bit","English (U.K.)","Documentary photograph",HLS01166.tif,,,,,,,,,,,,,,,,,,,,,,,,,,,,,,,,,,,,"Carlton Hotel,Hebden Bridge,Public Houses,Pubs Inns and Hotels,Taverns",https://penninehorizons.org/files/original/796a4ab18a728f9126d7fe7ebdeb1cf7.jpg,"Still Image","Hebden Bridge Local History Society",1,0
6457,https://penninehorizons.org/items/show/6457,"Carlton Hotel.  Hebden Bridge - HLS01167","Carlton Hotel, Hebden Bridge, Places, Public Houses, Pubs Inns & Hotels, Taverns",Banquet,,,,"No date yet","PH78 - Hebden Bridge Local History Society","PHDA - Hebden Bridge Local History Society","Pennine Horizons Digital Archive","TIFF file 8-bit","English (U.K.)","Documentary photograph",HLS01167.tif,,,,,,,,,,,,,,,,,,,,,,,,,,,,,,,,,,,,"Carlton Hotel,Hebden Bridge,Public Houses,Pubs Inns and Hotels,Taverns",https://penninehorizons.org/files/original/de171b2d992ffd07855b0c7b7eab30d0.jpg,"Still Image","Hebden Bridge Local History Society",1,0
11214,https://penninehorizons.org/items/show/11214,"Carlton Street, looking towards Crown Street, Hebden Bridge - BIM00398","Buildings, Carlton Street, Co-operative  Building, Crown Street, Hebden Bridge, Places, Public Houses, Pubs Inns & Hotels, Street Names, Taverns, Transport, Working Men's Club",,"Bill Marsden","Bill Marsden","Pennine Horizons Digital Archive",1990s,,"PHDA - Bill Marsden Collection","Pennine Horizons Digital Archive","TIFF file 8-bit","English (U.K.)","Documentary photograph",BIM00398.tif,"Hebden Bridge",,,,,,,,,,,,,,,,,,,,,,,,,,,,,,,,,,,"Buildings,Carlton Street,Co-operative  Building,Crown Street,Hebden Bridge,Public Houses,Pubs Inns and Hotels,Street Names,Taverns,Transport,Working Men's Club",https://penninehorizons.org/files/original/0e94ff110ccfb9c3d6aa234c79722fe0.jpg,"Still Image","Bill Marsden collection",1,0
14108,https://penninehorizons.org/items/show/14108,"Carriages outside The Old White Lion Hotel - ALC01451","Governess Cart, Hebden Bridge, Horse-drawn Carriage, Places, Public Houses, Pubs Inns & Hotels, Taverns, White Lion Hotel","Probably 1907. Benjamin Sykes, landlord, is standing in the doorway of his hotel.",,"Pennine Horizons Digital Archive","Pennine Horizons Digital Archive",1900s,,"PHDA - Alice Longstaff Collection","Pennine Horizons Digital Archive","TIFF file 8-bit","English (U.K.)","Documentary photograph",ALC01451.tif,,,,,,,,,,,,,,,,,,,,,,,,,,,,,,,,,,,,"#Pub,Governess Cart,Hebden Bridge,Horse,Horse-drawn Carriage,Public Houses,Pubs Inns and Hotels,Taverns,White Lion Hotel",https://penninehorizons.org/files/original/fc829c2b457332decd6dee0ac24c1fc3.jpg,"Still Image","Alice Longstaff - General Pictures",1,0
14111,https://penninehorizons.org/items/show/14111,"Carriages outside The Old White Lion Hotel - ALC01454","Cobbles, Hebden Bridge, Horses, People, People at Leisure, Public Houses, Pubs Inns & Hotels, Taverns, White Lion Hotel, landau",,,"Pennine Horizons Digital Archive","Pennine Horizons Digital Archive","No date yet",,"PHDA - Alice Longstaff Collection","Pennine Horizons Digital Archive","TIFF file 8-bit","English (U.K.)","Documentary photograph",ALC01454.tif,,,,,,,,,,,,,,,,,,,,,,,,,,,,,,,,,,,,"Cobbles,Hebden Bridge,Horse,Horses,landau,People,People at Leisure,Public Houses,Pubs Inns and Hotels,Taverns,White Lion Hotel",https://penninehorizons.org/files/original/9a2d43182f2424d014fd5d8307975250.jpg,"Still Image","Alice Longstaff - General Pictures",1,0
14110,https://penninehorizons.org/items/show/14110,"Carriages outside The Old White Lion Hotel, 1907 - ALC01453","Cobbles, Hebden Bridge, Horses, People, People at Leisure, Public Houses, Pubs Inns & Hotels, Taverns, White Lion Hotel, landau","From Mrs Carol Mosley (nee Astin). Some detail as to the people shown in the photographs might be useful. The four people seated in the 'landau' are my great grandparents on my father's side. On the left are John Astin (then a fustian manufacturer in Hebden Bridge) and his wife Emma and on the right are Benjamin Sykes (then landlord of the White Lion) and his wife Hephzibah. I am unable to put a name to the young girl standing between the two couples. The people in and standing near the larger vehicle on the other photograph seem again to be from the two families (Astin and Sykes) and I wonder if either or both photographs are linked somehow to the wedding of my grandfather and grandmother (Wilbert Astin and Sarah Sykes), which took place 31st July 1907. If this is the case these photographs were really 'hot off the press' as they are both postmarked with the date 2nd August 1907. Whilst the men are wearing buttonholes their outfits are not the same as they are seen wearing in the wedding photographs, which I have. Perhaps it was an engagement celebration of some sort. ",,"Pennine Horizons Digital Archive","Pennine Horizons Digital Archive",1900s,,"PHDA - Alice Longstaff Collection","Pennine Horizons Digital Archive","TIFF file 8-bit","English (U.K.)","Documentary photograph",ALC01453.tif,,,,,,,,,,,,,,,,,,,,,,,,,,,,,,,,,,,,"Cobbles,Hebden Bridge,Horse,Horses,landau,People,People at Leisure,Public Houses,Pubs Inns and Hotels,Taverns,White Lion Hotel",https://penninehorizons.org/files/original/48b739f6f230c9804584f5946241daf4.jpg,"Still Image","Alice Longstaff - General Pictures",1,0
25458,https://penninehorizons.org/items/show/25458,"Carter's Club, Todmorden - HCC00279","People, People at Leisure, People at Work, Places, Public Houses, Pubs Inns & Hotels, Taverns, Todmorden","Earnest Copping pulling a pint. He died 4.4.74 so this picture is probably taken in the early 70s. The club was also known as 'Rat Trap'. Donated by Karen Senior.",Unknown,"Karen Senior","Pennine Horizons Digital Archive",1970s,"Karen Senior","PHDA - Horizons Community Collection","Pennine Horizons Digital Archive","TIFF file 8-bit","English (U.K.)","Documentary photograph",HCC,,,,,,,,,,,,,,,,,,,,,,,,,,,,,,,,,,,,"People,People at Leisure,People at Work,Places,Public Houses,Pubs Inns & Hotels,Taverns,Todmorden",https://penninehorizons.org/files/original/5213a26277d20543938b122b1e09cc91.jpg,"Still Image","Community collection",1,0
34505,https://penninehorizons.org/items/show/34505,"Cat i Well, Saltonstall, Luddenden Dean - BIM01225","Colour, Luddenden Valley, Public Houses, Pubs Inns & Hotels, Taverns, Wainstalls Halifax",,"Bill Marsden",,,,,"PHDA - Bill Marsden Collection","Pennine Horizons Digital Archive","TIFF file 8-bit","English (U.K.)","Documentary photograph",BIM01225.TIF,,,,,,,,,,,,,,,,,,,,,,,,,,,,,,,,,,,,"Colour,Luddenden Valley,Public Houses,Pubs Inns & Hotels,Taverns,Wainstalls Halifax",https://penninehorizons.org/files/original/12cd0d3e427a8bbdcde235603a2f18d2.jpg,"Still Image","Bill Marsden collection",1,0
212,https://penninehorizons.org/items/show/212,"Cleaning Windows at The Albert, Hebden Bridge - AGW00131","Buildings, Carlton Building, Flag, Hebden Bridge, Hope Street, Places, Public Houses, Pubs Inns & Hotels, Retail, Shop, Shops, Street Names, Taverns, Transport",,"Alan Greenwood","Alan Greenwood","Pennine Horizons Digital Archive","2007-07-27T13:19:06+01:00 , 2000s","Alan Greenwood","PHDA - Alan Greenwood Collection","Pennine Horizons Digital Archive","TIFF file 8-bit","English (U.K.)","Documentary photograph",AGW00131.tif,"Hebden Bridge",,,,,,,,,,,,,,,,,,,,,,,,,,,,,,,,,,,"Buildings,Carlton Building,Flag,Hebden Bridge,Hope Street,Ladder,Pub sign,Public Houses,Pubs Inns and Hotels,Retail,Shop,Shops,Sign,Street Names,Taverns,Transport,Window cleaner",https://penninehorizons.org/files/original/562df8735a015af57c50d4a94000a1f1.jpg,"Still Image","Alan Greenwood Collection",1,0
5867,https://penninehorizons.org/items/show/5867,"Clegg Nook, Mytholmroyd, 1959 - HBC00921 ","Mytholmroyd, Places, Public Houses, Pubs Inns & Hotels, Railway, Railway Viaduct, Railways, Shoulder of Mutton, Taverns","The junction of Cragg Road, New Road and Scout Road",Unknown,"Hebden Bridge Camera Club","Pennine Horizons Digital Archive",1950s,"Hebden Bridge Camera Club","PHDA - Hebden Bridge Camera Club","Pennine Horizons Digital Archive","TIFF file 8-bit","English (U.K.)","Documentary photograph",HBC00921.tif,,,,,,,,,,,,,,,,,,,,,,,,,,,,,,,,,,,,"1950s,Mytholmroyd,Public Houses,Pubs Inns and Hotels,Railway,Railway Viaduct,Railways,Shoulder of Mutton,Taverns",https://penninehorizons.org/files/original/28af97837817bb348980a55b8e9cec0d.jpg,"Still Image","Hebden Bridge Camera Club - The Changing Face of Hebden Bridge",1,0
20212,https://penninehorizons.org/items/show/20212,"Commercial Street, Hebden Bridge post 1962. - KEC00416","Commercial Street, Hebden Bridge, Lees Yard, Places, Public Houses, Pubs Inns & Hotels, St George's Square, Street Names, Taverns, White Horse Hotel","Centre right the site of the former White Horse, demolished 1962, now Lees Yard then looking over St George's Square to the Shoulder of Mutton on Bridgegate. Part of the Hebden Bridge Local History Society Archive","Kenneth Crabtree","Pennine Horizons Digital Archive","Pennine Horizons Digital Archive","No date yet","Hebden Bridge Local History Society","PHDA - Hebden Bridge Local History Society","Pennine Horizons Digital Archive","TIFF file 8-bit","English (U.K.)","Documentary photograph",KEC00416.tif,"Hebden Bridge",,,,,,,,,,,,,,,,,,,,,,,,,,,,,,,,,,,"Commercial Street,Hebden Bridge,Lees Yard,Places,Public Houses,Pubs Inns & Hotels,St George's Square,Street Names,Taverns,White Horse Hotel",https://penninehorizons.org/files/original/36b4c95522333b2d3b20a91631ed8bcf.jpg,"Still Image","Ken Crabtree Collection",1,0
20211,https://penninehorizons.org/items/show/20211,"Commercial Street, Hebden Bridge pre-1959. - KEC00415","Commercial Street, Hebden Bridge, Keighley Road, Places, Public Houses, Pubs Inns & Hotels, Street Names, Taverns, White Horse Hotel, White Lion Hotel","Prior to its re-alignment Commercial Street ran to the front of the White Lion as seen here with a right turn for Keighley Road. The building on the extreme left is part of the White Horse, demolished 1962, and the building centre right was demolished 1959 to re-align the junction between Commercial Street and Keighley Road. Part of the Hebden Bridge Local History Society Archive","Kenneth Crabtree","Pennine Horizons Digital Archive","Pennine Horizons Digital Archive","No date yet","Hebden Bridge Local History Society","PHDA - Hebden Bridge Local History Society","Pennine Horizons Digital Archive","TIFF file 8-bit","English (U.K.)","Documentary photograph",KEC00415.tif,"Hebden Bridge",,,,,,,,,,,,,,,,,,,,,,,,,,,,,,,,,,,"Commercial Street,Hebden Bridge,Keighley Road,Places,Public Houses,Pubs Inns & Hotels,Street Names,Taverns,White Horse Hotel,White Lion Hotel",https://penninehorizons.org/files/original/7152035f183dc8a53677b34fd3113536.jpg,"Still Image","Ken Crabtree Collection",1,0
27119,https://penninehorizons.org/items/show/27119,"Cornholme Working Men's Club Football Team - TAL00157","Cornholme, Football, Football team, Places, Public Houses, Pubs Inns & Hotels, Sport, Sport and Recreation, Taverns, Trophy, Working Men's Club","League winners 1908/09 season. AN 55941289",,"Todmorden Antiquarian Society","Pennine Horizons Digital Archive",1909,,"PHDA - Todmorden Antiquarian Society","Pennine Horizons Digital Archive","TIFF file 8-bit","English (U.K.)","Documentary photograph",TAL00157.tif,,,,,,,,,,,,,,,,,,,,,,,,,,,,,,,,,,,,"Cornholme,Football,Football team,Places,Public Houses,Pubs Inns & Hotels,Sport,Sport and recreation,Taverns,Trophy,Working Men's Club",https://penninehorizons.org/files/original/be41d50bd1d3e14debd0676ab27face3.jpg,"Still Image","Todmorden Antiquarian Society Photographs at the Library",1,0
27909,https://penninehorizons.org/items/show/27909,"Cottage and Maypole Inn, Warley - KST00202","Public Houses, Pubs Inns & Hotels, Taverns, Warley",,"Ken Stott",,"Pennine Horizons Digital Archive",2013-08-30T12:00:04,,"PHDA - Ken Stott Collection","Pennine Horizons Digital Archive","TIFF file 8-bit","English (U.K.)","Documentary photograph",KST00202.tif,,,,,,,,,,,,,,,,,,,,,,,,,,,,,,,,,,,,"Public Houses,Pubs Inns & Hotels,Taverns,Warley",https://penninehorizons.org/files/original/811be31573c5818187d59ab50476e680.jpg,"Still Image","Ken Stott Collection",1,0
10404,https://penninehorizons.org/items/show/10404,"Cragg Vale Inn - GEE00116","Cragg Vale Inn, Hinchliffe Arms, Public Houses, Pubs Inns & Hotels, Taverns","Cragg Vale Inn replaced previous Cragg Vale Inn. Thomas Whittingham, Licensed Victualler",Unknown,"Pennine Horizons Digital Archive","Pennine Horizons Digital Archive","No date yet","Stephen Gee","PHDA - Stephen Gee Collection","Pennine Horizons Digital Archive","TIFF file 8-bit","English (U.K.)","Documentary photograph",GEE00116.TIF,,,,,,,,,,,,,,,,,,,,,,,,,,,,,,,,,,,,"#Pub,Cragg Vale Inn,Hinchliffe Arms,Public Houses,Pubs Inns and Hotels,Taverns",https://penninehorizons.org/files/original/e440f76e54cd9f6045f809e7a0f307bb.jpg,"Still Image","Stephen Gee collection",1,0
10403,https://penninehorizons.org/items/show/10403,"Cragg Vale Inn 1860's - GEE00115","Cragg Vale, Cragg Vale Inn, Places, Public Houses, Pubs Inns & Hotels, Taverns","Former Cragg Vale Inn",Unknown,"Pennine Horizons Digital Archive","Pennine Horizons Digital Archive","No date yet","Stephen Gee","PHDA - Stephen Gee Collection","Pennine Horizons Digital Archive","TIFF file 8-bit","English (U.K.)","Documentary photograph",GEE00115.TIF,,,,,,,,,,,,,,,,,,,,,,,,,,,,,,,,,,,,"#Cragg Vale,#Pub,Cragg Vale,Cragg Vale Inn,Public Houses,Pubs Inns and Hotels,Taverns",https://penninehorizons.org/files/original/8797939c3649862998d11b8b7ce4b5ac.jpg,"Still Image","Stephen Gee collection",1,0
4732,https://penninehorizons.org/items/show/4732,"Crash at The Red House Pub - Todmorden - DMC00459","Accident, Event, Events, Public Houses, Pubs Inns & Hotels, Red House, Taverns","Scanned from photograph","David Martin","Pennine Horizons Digital Archive","Pennine Horizons Digital Archive","No date yet","David Martin","PHDA - David Martin Collection","Pennine Horizons Digital Archive","TIFF file 8-bit","English (U.K.)","Documentary photograph",DMC00459.tif,",  ",,,,,,,,,,,,,,,,,,,,,,,,,,,,,,,,,,,"Accident,Event,Events,Public Houses,Pubs Inns and Hotels,Red House,Taverns",https://penninehorizons.org/files/original/386c6eb65af1d614c5d9a86c305f5114.jpg,"Still Image","David's Own Pictures",1,0
23802,https://penninehorizons.org/items/show/23802,"Crown Hotel, Halifax 1979 - CBC06001","Halifax, Places, Public Houses, Pubs Inns & Hotels, Taverns","Crown Hotel & adjoining property.  Horton Street 1979.",,"Pennine Horizons Digital Archive","Pennine Horizons Digital Archive","1979 , 1970s","Calderdale MBC","PHDA - Calderdale MBC","Pennine Horizons Digital Archive","TIFF file 8-bit","English (U.K.)","Documentary photograph",CBC06001.tif,,,,,,,,,,,,,,,,,,,,,,,,,,,,,,,,,,,,"Halifax,Places,Public Houses,Pubs Inns & Hotels,Taverns",https://penninehorizons.org/files/original/6d8172d91ad0ba9f9f25c14740c76095.jpg,"Still Image","CMBC Conservation and Planning collection",1,0
23717,https://penninehorizons.org/items/show/23717,"Crown Hotel, Horton Street, Halifax. 1979. - CBC06127","Architecture, Crown Hotel, Halifax, Horton Street, Public Houses, Pubs Inns & Hotels, Taverns",,,"Pennine Horizons Digital Archive","Pennine Horizons Digital Archive","1979 , 1970s","Calderdale MBC","PHDA - Calderdale MBC","Pennine Horizons Digital Archive","TIFF file 8-bit","English (U.K.)","Documentary photograph",CBC06127.tif,Halifax,,,,,,,,,,,,,,,,,,,,,,,,,,,,,,,,,,,"Architecture,Crown Hotel,Halifax,Horton Street,Public Houses,Pubs Inns & Hotels,Taverns",https://penninehorizons.org/files/original/7b714b14a548b684544ee5fd244f785f.jpg,"Still Image","CMBC Conservation and Planning collection",1,0
34497,https://penninehorizons.org/items/show/34497,"Crown Street, Hebden Bridge - BIM01212","Building, Colour, Crown Street, Hebden Bridge, Public Houses, Pubs Inns & Hotels, Retail, Shop, Shops, Street Names, Taverns","A building that has had several names. Originally the Liberal Rooms, it has been the home of Hebden Bridge Sports and Social Club, Crown House Hotel, Greenwood Inn, currently (2020) the Crown Inn.","Bill Marsden",,,,,"PHDA - Bill Marsden Collection","Pennine Horizons Digital Archive","TIFF file 8-bit","English (U.K.)","Documentary photograph",BIM01212.TIF,,,,,,,,,,,,,,,,,,,,,,,,,,,,,,,,,,,,"Building,Colour,Crown Street,Hebden Bridge,Public Houses,Pubs Inns & Hotels,Retail,Shop,Shops,Street Names,Taverns",https://penninehorizons.org/files/original/3af88741ee997c12cd22cb82d98dbc51.jpg,"Still Image","Bill Marsden collection",1,0
5637,https://penninehorizons.org/items/show/5637,"Crown Street, Hebden Bridge 1960s - HBC00691 ","Buildings, Co-operative  Building, Crown Street, Hebden Bridge, Public Houses, Pubs Inns & Hotels, Snow, Street Names, Taverns, White Horse Hotel, clock tower","Note the White horse Hotel.","Halifax Courier","Hebden Bridge Camera Club","Pennine Horizons Digital Archive",1960s,"Hebden Bridge Camera Club","PHDA - Hebden Bridge Camera Club","Pennine Horizons Digital Archive","TIFF file 8-bit","English (U.K.)","Documentary photograph",HBC00691.tif,,,,,,,,,,,,,,,,,,,,,,,,,,,,,,,,,,,,"1960s,Buildings,Clock tower,Co-operative  Building,Crown Street,Hebden Bridge,Public Houses,Pubs Inns and Hotels,Snow,Street Names,Taverns,White Horse Hotel",https://penninehorizons.org/files/original/65f5c38c47697aa8568565f7327587b8.jpg,"Still Image","Hebden Bridge Camera Club - The Changing Face of Hebden Bridge",1,0
21953,https://penninehorizons.org/items/show/21953,"Danny Parker - JAE00210","Hebden Bridge 500 faces, Male, People, People at Work, Portrait, Public Houses, Pubs Inns & Hotels, Taverns",c.2009,"Jason Elliott","Hebden Royd Town Council","Pennine Horizons Digital Archive",2008-12-10T13:49:20Z,"Jason Elliott","PHDA - Jason Elliott Collection","Pennine Horizons Digital Archive","TIFF file 8-bit","English (U.K.)","Documentary photograph",JAE00210.tif,,,,,,,,,,,,,,,,,,,,,,,,,,,,,,,,,,,,"Hebden Bridge 500 faces,Male,People,People at Work,Portrait,Public Houses,Pubs Inns & Hotels,Taverns",https://penninehorizons.org/files/original/626a31808f18b0d8d49330009931e2c9.jpg,"Still Image","Jason Elliott Collection - 500 Faces of Hebden Bridge",1,0
