﻿"Item Id","Item URI","Dublin Core:Title","Dublin Core:Subject","Dublin Core:Description","Dublin Core:Creator","Dublin Core:Source","Dublin Core:Publisher","Dublin Core:Date","Dublin Core:Contributor","Dublin Core:Rights","Dublin Core:Relation","Dublin Core:Format","Dublin Core:Language","Dublin Core:Type","Dublin Core:Identifier","Dublin Core:Coverage","Item Type Metadata:Lesson Plan Text","Item Type Metadata:Bibliography","Item Type Metadata:Biographical Text","Item Type Metadata:Occupation","Item Type Metadata:Death Date","Item Type Metadata:Birthplace","Item Type Metadata:Birth Date","Item Type Metadata:Participants","Item Type Metadata:Event Type","Item Type Metadata:URL","Item Type Metadata:Bit Rate/Frequency","Item Type Metadata:Interviewer","Item Type Metadata:Interviewee","Item Type Metadata:Location","Item Type Metadata:Transcription","Item Type Metadata:Local URL","Item Type Metadata:Original Format","Item Type Metadata:Physical Dimensions","Item Type Metadata:Duration","Item Type Metadata:Compression","Item Type Metadata:Producer","Item Type Metadata:Director","Item Type Metadata:Text","Item Type Metadata:Time Summary","Item Type Metadata:Email Body","Item Type Metadata:Subject Line","Item Type Metadata:From","Item Type Metadata:To","Item Type Metadata:CC","Item Type Metadata:BCC","Item Type Metadata:Number of Attachments","Item Type Metadata:Standards","Item Type Metadata:Objectives","Item Type Metadata:Materials",tags,file,itemType,collection,public,featured
6684,https://penninehorizons.org/items/show/6684,"Green Hill Terrace, Halifax - HLS01404","Drawing, Green Hill Terrace, Halifax, Places, Sketch, Street Names","PH15. 1969 calendar.  Demolished in 1967 it was described as possibly the only complete example in Halifax of a terrace in the Regency style.  The Regency influence was confined to the arch over the doorway, though the windows were originally small panes and fitted with interior folding shutters.  Inside, the houses had an open return stsaircase with moulded stone steps.","J. L. Berbiers ",,,"No date yet",,"PHDA - Hebden Bridge Local History Society","Pennine Horizons Digital Archive","TIFF file 8-bit","English (U.K.)","Documentary photograph",HLS01404.tif,,,,,,,,,,,,,,,,,,,,,,,,,,,,,,,,,,,,"Drawing,Green Hill Terrace,Halifax,Sketch,Street Names",https://penninehorizons.org/files/original/3313765c8b600237ac433a5934ffb3e1.jpg,"Still Image","Hebden Bridge Local History Society",1,0
6685,https://penninehorizons.org/items/show/6685,"Wainhouse Terrace, Halifax - HLS01405","Drawing, Halifax, Places, Sketch, Street Names, Wainhouse Terrace","PH15. 1969 calendar. Not widely known because it is out of general sight between Burnley and Rochdale Roads, past Kings Cross.  The galleried houses take their name from J. E. Wainhouse, builder of more famous and certainly more visible Wainhouse Tower but it is held that Wainhouse did not build the properties but embellished existing houses.","J. L. Berbiers ",,,"No date yet",,"PHDA - Hebden Bridge Local History Society","Pennine Horizons Digital Archive","TIFF file 8-bit","English (U.K.)","Documentary photograph",HLS01405.tif,,,,,,,,,,,,,,,,,,,,,,,,,,,,,,,,,,,,"Drawing,Halifax,Sketch,Street Names,Wainhouse Terrace",https://penninehorizons.org/files/original/4c7d794e957a21ec287c50080a142ab2.jpg,"Still Image","Hebden Bridge Local History Society",1,0
6686,https://penninehorizons.org/items/show/6686,"Stannery Lane, Halifax. - HLS01406","Drawing, Halifax, Places, Sketch, Stannary Lane, Street Names","PH15. 1969 calendar. It derives its name from stoneary for once stone was quarried from the hillside here when it was still a hamlet isolated from Halifax.","J. L. Berbiers ",,,"No date yet",,"PHDA - Hebden Bridge Local History Society","Pennine Horizons Digital Archive","TIFF file 8-bit","English (U.K.)","Documentary photograph",HLS01406.tif,,,,,,,,,,,,,,,,,,,,,,,,,,,,,,,,,,,,"Drawing,Halifax,Sketch,Stannary Lane,Street Names",https://penninehorizons.org/files/original/899114c3ba5552f0579c39b16554b07a.jpg,"Still Image","Hebden Bridge Local History Society",1,0
6687,https://penninehorizons.org/items/show/6687,"Boothtown House, Halifax - HLS01407","Architecture, Boothtown House, Buildings, Drawing, Halifax, Places, Sketch","Seen from Hall Street North, it is an Old Boothtown landmark which was exempted from demolition in the area because of its historical and architectural interest.","J. L. Berbiers ",,,"No date yet",,"PHDA - Hebden Bridge Local History Society","Pennine Horizons Digital Archive","TIFF file 8-bit","English (U.K.)","Documentary photograph",HLS01407.tif,,,,,,,,,,,,,,,,,,,,,,,,,,,,,,,,,,,,"Architecture,Boothtown House,Buildings,Drawing,Halifax,Sketch",https://penninehorizons.org/files/original/bc82333b27641b9b8df2a286bbb72861.jpg,"Still Image","Hebden Bridge Local History Society",1,0
6688,https://penninehorizons.org/items/show/6688,"Union Mills, Halifax - HLS01408","Drawing, Halifax, Places, Sketch, Union Mills","1969 calendar. Situated on Pellon Lane it is a fine example of the substantial and impressive nature of the portals of many 19th Century industrial premises.  Union Mills of S Highley & Company , worsted manufacturers, was largely rebuilt after a disatrous fire in 1900. PH15.","J. L. Berbiers ",,,1900s,,"PHDA - Hebden Bridge Local History Society","Pennine Horizons Digital Archive","TIFF file 8-bit","English (U.K.)","Documentary photograph",HLS01408.tif,,,,,,,,,,,,,,,,,,,,,,,,,,,,,,,,,,,,"Drawing,Halifax,Sketch,Union Mills",https://penninehorizons.org/files/original/1464807f50b4357e77246663da584b6a.jpg,"Still Image","Hebden Bridge Local History Society",1,0
6689,https://penninehorizons.org/items/show/6689,"Earl Street, Halifax - HLS01409","Claremount, Drawing, Earl Street, Halifax, Places, Sketch, Street Names","1969 calendar.  Claremount, Halifax is a scene typical of the area known as Beaumont Town - 19th century cottage property with setted highway and flagged pavements. At the fall of the slope is St Thomas's School. PH15.","J. L. Berbiers ",,,"No date yet",,"PHDA - Hebden Bridge Local History Society","Pennine Horizons Digital Archive","TIFF file 8-bit","English (U.K.)","Documentary photograph",HLS01409.tif,,,,,,,,,,,,,,,,,,,,,,,,,,,,,,,,,,,,"Claremount,Drawing,Earl Street,Halifax,Sketch,Street Names",https://penninehorizons.org/files/original/ca79e4aa231dd015669f83a362c3805e.jpg,"Still Image","Hebden Bridge Local History Society",1,0
6690,https://penninehorizons.org/items/show/6690,"Swaine's Terrace, Halifax - HLS01410","Architecture, Drawing, Halifax, Places, Sketch, Street Names, Swaine's Terrace","1969 calendar. In the Haugh Shaw district of Halifax it provides another example of the use of the gallery to counteract the building difficulties of sloping land.  The extra storey at the lower level of the building gave scope for either cellaring or the creation of cellar cottages with access under the gallery. PH15.","J. L. Berbiers ",,,"No date yet",,"PHDA - Hebden Bridge Local History Society","Pennine Horizons Digital Archive","TIFF file 8-bit","English (U.K.)","Documentary photograph",HLS01410.tif,,,,,,,,,,,,,,,,,,,,,,,,,,,,,,,,,,,,"Architecture,Drawing,Halifax,Sketch,Street Names,Swaine's Terrace",https://penninehorizons.org/files/original/0136cc60fe1eec3b6b8552344da93b55.jpg,"Still Image","Hebden Bridge Local History Society",1,0
6691,https://penninehorizons.org/items/show/6691,"Ramsden Street, Halifax - HLS01411","Drawing, Halifax, Places, Ramsden Street, Sketch, Street Names, Wheatley","1969 calendar. Wheatley, Halifax shows a particular feature of a West Riding building in the 19th Century, when the handicap of a narrow site on a steeply rising hillside was overcome by putting one house on top of another with access at different levels.  On the right, another characteristic of the period's hillside building - the galleried sidewalk. PH15.","J. L. Berbiers ",,,"No date yet",,"PHDA - Hebden Bridge Local History Society","Pennine Horizons Digital Archive","TIFF file 8-bit","English (U.K.)","Documentary photograph",HLS01411.tif,,,,,,,,,,,,,,,,,,,,,,,,,,,,,,,,,,,,"Drawing,Halifax,Ramsden Street,Sketch,Street Names,Wheatley",https://penninehorizons.org/files/original/818a69970842c12bf56d6183d122979d.jpg,"Still Image","Hebden Bridge Local History Society",1,0
6692,https://penninehorizons.org/items/show/6692,"Waterloo Street, Boothtown, Halifax - HLS01412","Drawing, Halifax, Places, Sketch, Street Names, Waterloo Street","1969 calendar. Typical galleried houses and cellar cottages of the hilly West Riding - Waterloo Street, Boothtown as it once was.  PH15.","J. L. Berbiers ",,,"No date yet",,"PHDA - Hebden Bridge Local History Society","Pennine Horizons Digital Archive","TIFF file 8-bit","English (U.K.)","Documentary photograph",HLS01412.tif,,,,,,,,,,,,,,,,,,,,,,,,,,,,,,,,,,,,"Drawing,Halifax,Sketch,Street Names,Waterloo Street",https://penninehorizons.org/files/original/d6e3507a3831a8a30ba300e97b758896.jpg,"Still Image","Hebden Bridge Local History Society",1,0
6693,https://penninehorizons.org/items/show/6693,"Woolshops, Halifax - HLS01413","Architecture, Drawing, Halifax, Places, Sketch, Woolshops","1969 calendar. The name is said to be unique - an area of Halifax which has undergone marked change in every generation of the past century.  \it is the original location of the warehouses and shops of the wool staplers or wool drivers. PH15.","J. L. Berbiers ",,,"No date yet",,"PHDA - Hebden Bridge Local History Society","Pennine Horizons Digital Archive","TIFF file 8-bit","English (U.K.)","Documentary photograph",HLS01413.tif,,,,,,,,,,,,,,,,,,,,,,,,,,,,,,,,,,,,"Architecture,Drawing,Halifax,Sketch,Woolshops",https://penninehorizons.org/files/original/767b44472461fea2b768017230592b32.jpg,"Still Image","Hebden Bridge Local History Society",1,0
6694,https://penninehorizons.org/items/show/6694,"Range Bank, Halifax - HLS01414","Architecture, Drawing, Halifax, New Bank, Places, Range Bank, Sketch","1969 calendar. One of Halifax's steepest gradients looking down towards New Bank and North Bridge .  With a slope of over 1 in 5 it was once part of the main road from Halifax to Bradford over Swales Moor. PH15.","J. L. Berbiers ",,,"No date yet",,"PHDA - Hebden Bridge Local History Society","Pennine Horizons Digital Archive","TIFF file 8-bit","English (U.K.)","Documentary photograph",HLS01414.tif,,,,,,,,,,,,,,,,,,,,,,,,,,,,,,,,,,,,"Architecture,Drawing,Halifax,New Bank,Range Bank,Sketch",https://penninehorizons.org/files/original/6e20e57c761b99d7e49982d862c11fe3.jpg,"Still Image","Hebden Bridge Local History Society",1,0
6736,https://penninehorizons.org/items/show/6736,"Hebden Bridge Mill - HLS01482","Buildings, Drawing, Halifax Courier Ltd., Hebden Bridge, Mill, Mills, Places, Sketch","PH/25.  The sketch and description are from The Calderdale Sketch Book by J. L. Berbiers, published in 1973 by The Halifax Courier Ltd. Strange how quickly attitudes change","John L Berbiers",,,"No date yet",,"PHDA - Hebden Bridge Local History Society","Pennine Horizons Digital Archive","TIFF file 8-bit","English (U.K.)","Documentary photograph",HLS01482.tif,,,,,,,,,,,,,,,,,,,,,,,,,,,,,,,,,,,,"Buildings,Drawing,Halifax Courier Ltd.,Hebden Bridge,Mill,Mills,Sketch",https://penninehorizons.org/files/original/a412f76642488773fb2de424d8d6f0f7.jpg,"Still Image","Hebden Bridge Local History Society",1,0
6866,https://penninehorizons.org/items/show/6866,"Mr Tim Bobbin - HLS05122","Drawing, Lantern Slide, Prints, Teeth Removal, Tim Bobbin","Series of prints containing caricatures of teeth removal.",,,,2013-02-19T15:58:34,,"PHDA - Hebden Bridge Local History Society","Pennine Horizons Digital Archive","TIFF file 8-bit","English (U.K.)","Documentary photograph",HLS05122.tif,,,,,,,,,,,,,,,,,,,,,,,,,,,,,,,,,,,,"Drawing,Lantern Slide,Prints,Teeth Removal,Tim Bobbin",https://penninehorizons.org/files/original/89e20686ff90be0100a9ce85230c5181.jpg,"Still Image","Hebden Bridge Local History Society",1,0
6867,https://penninehorizons.org/items/show/6867,"Mr Tim Bobbin - HLS05123","Drawing, Lantern Slide, Prints, Teeth Removal, Tim Bobbin","HLS05123. Series of prints containing caricatures of teeth removal.",,,,2013-02-19T15:59:39,,"PHDA - Hebden Bridge Local History Society","Pennine Horizons Digital Archive","TIFF file 8-bit","English (U.K.)","Documentary photograph",HLS05123.tif,,,,,,,,,,,,,,,,,,,,,,,,,,,,,,,,,,,,"Drawing,Lantern Slide,Prints,Teeth Removal,Tim Bobbin",https://penninehorizons.org/files/original/0d2064cff238d98a78635eab85bd1163.jpg,"Still Image","Hebden Bridge Local History Society",1,0
6868,https://penninehorizons.org/items/show/6868,"Mr Tim Bobbin - HLS05124","Drawing, Lantern Slide, Prints, Teeth Removal, Tim Bobbin","HLS05124. Series of prints containing caricatures of teeth removal.",,,,2013-02-19T16:00:25,,"PHDA - Hebden Bridge Local History Society","Pennine Horizons Digital Archive","TIFF file 8-bit","English (U.K.)","Documentary photograph",HLS05124.tif,,,,,,,,,,,,,,,,,,,,,,,,,,,,,,,,,,,,"Drawing,Lantern Slide,Prints,Teeth Removal,Tim Bobbin",https://penninehorizons.org/files/original/b6bb35beb1e19db07a0a85a659bbb0e2.jpg,"Still Image","Hebden Bridge Local History Society",1,0
6869,https://penninehorizons.org/items/show/6869,"Mr Tim Bobbin - HLS05125","Drawing, Lantern Slide, Prints, Teeth Removal, Tim Bobbin","HLS05125. Series of prints containing caricatures of teeth removal.",,,,2013-02-19T16:01:37,,"PHDA - Hebden Bridge Local History Society","Pennine Horizons Digital Archive","TIFF file 8-bit","English (U.K.)","Documentary photograph",HLS05125.tif,,,,,,,,,,,,,,,,,,,,,,,,,,,,,,,,,,,,"Drawing,Lantern Slide,Prints,Teeth Removal,Tim Bobbin",https://penninehorizons.org/files/original/17b38c70658ceaafc2dada95c2072bfa.jpg,"Still Image","Hebden Bridge Local History Society",1,0
7443,https://penninehorizons.org/items/show/7443,"Wood Lane Hall, Copy from Horner - HLS06050","Architecture, Buildings, Drawing, Hall, Places, Sowerby","Slide 3 - In 1706 John Dearden, grandson of the John who is supposed to have built the house, having by marriage come into the Hollins Estate, sold Wood Lane, to Jeremy Crossley of Lighthazles for £1100, described as a 'white Kerseyman.'The view of Wood lane Hall, now exhibited has been copied from John Horner's views of Halifax 1835, and shows what a beautifully wooded district Calder Dale was at that period.","George Hepworth","Hebden Bridge Literary & Scientific Society","Pennine Horizons Digital Archive","1905 , 1900s","Hebden Bridge Local History Society","PHDA - Hebden Bridge Local History Society","Pennine Horizons Digital Archive","TIFF file 8-bit","English (U.K.)","Documentary photograph",HLS06050.tif,"Yorkshire, UK",,,,,,,,,,,,,,,,,,,,,,,,,,,,,,,,,,,"Architecture,Buildings,Drawing,Hall,Sowerby",https://penninehorizons.org/files/original/30c0cc05bb74449b703d24e177aa63aa.jpg,"Still Image","Historic Homes of Yorkshire collection",1,0
10612,https://penninehorizons.org/items/show/10612,"Lord Bros.  Textile Machinery, Canal Street Works. - MOT00303","Drawing, Engineering","An illustration of the Lord Bros site, showing Stackhills Road and Baltimore in the foreground.",,"Todmorden Information Centre Trust","Pennine Horizons Digital Archive","No date yet","Roger Birch","PHDA - Todmorden Information Centre Trust","Pennine Horizons Digital Archive","TIFF file 8-bit","English (U.K.)","Documentary photograph",MOT00303.tif,Todmorden,,,,,,,,,,,,,,,,,,,,,,,,,,,,,,,,,,,"Drawing,Engineering",https://penninehorizons.org/files/original/2098487a3072b79ab89dfd21176eb000.jpg,"Still Image","The Making of Todmorden exhibition",1,0
16728,https://penninehorizons.org/items/show/16728,"Drawing of Todmorden - ALC05149","Church, Churches & Chapels, Churches_&_Chapels, Drawing, Horse & Cart, Minster, Places, Railway, Railways, St Mary's, Steam train, Todmorden","The town is looking very elegant. St Mary's church is left of centre, with Cross Stone church on the skyline.",,"Pennine Horizons Digital Archive","Pennine Horizons Digital Archive","No date yet",,"PHDA - Alice Longstaff Collection","Pennine Horizons Digital Archive","TIFF file 8-bit","English (U.K.)","Documentary photograph",ALC05149.tif,,,,,,,,,,,,,,,,,,,,,,,,,,,,,,,,,,,,"Church,Churches and Chapels,Drawing,Horse & Cart,Minster,Railway,Railways,St Mary's,Steam train,Todmorden",https://penninehorizons.org/files/original/68bcb27e7f941dbefd89c2659736ba5b.jpg,"Still Image","Alice Longstaff - General Pictures",1,0
20680,https://penninehorizons.org/items/show/20680,"Todmorden Co-op Board of Directors in 1896 - MOT00458","Advertisement, Co-operative, Co-operative Movement, Drawing, Todmorden","Todmorden Industrial and Co-operative Society, list of Directors of the Board - 1896",Unknown,"Todmorden Information Centre Trust","Pennine Horizons Digital Archive","1896, 1890s","Todmorden Information Centre Trust","PHDA - Todmorden Information Centre Trust","Pennine Horizons Digital Archive","TIFF file 8-bit","English (U.K.)","Documentary photograph",MOT00458.tif,Todmorden,,,,,,,,,,,,,,,,,,,,,,,,,,,,,,,,,,,"Advertisement,Co-operative,Co-operative Movement,Drawing,Todmorden",https://penninehorizons.org/files/original/a170d634bf39748b3be9e8287c96ac89.jpg,"Still Image","The Making of Todmorden exhibition",1,0
20764,https://penninehorizons.org/items/show/20764,"Drawing of Buttress Brink - WSC00180","Buildings, Buttress Brink, Drawing, Hebden Bridge","Drawing of Buttress Brink by W. Shepherd","W. Shepherd","Pennine Horizons Digital Archive","Pennine Horizons Digital Archive","No date yet","W. Shepherd","PHDA - W. Shepherd Collection","Pennine Horizons Digital Archive","TIFF file 8-bit","English (U.K.)","Documentary photograph",WSC00180.tif,,,,,,,,,,,,,,,,,,,,,,,,,,,,,,,,,,,,"Buildings,Buttress Brink,Drawing,Hebden Bridge",https://penninehorizons.org/files/original/14227e4bbbeb089296124255fa874d50.jpg,"Still Image","W. Shepherd collection",1,0
23037,https://penninehorizons.org/items/show/23037,"Brooder - THB00117","Agriculture, Drawing, Equipment, Poultry, Thornbers",,Unknown,"Pennine Horizons Digital Archive","Pennine Horizons Digital Archive","No date yet",Thorbers,"PHDA - The Thornber Collection","Pennine Horizons Digital Archive","TIFF file 8-bit","English (U.K.)","Documentary photograph",THB00117.tif,,,,,,,,,,,,,,,,,,,,,,,,,,,,,,,,,,,,"Agriculture,Drawing,Equipment,Poultry,Thornbers",https://penninehorizons.org/files/original/0eea37bf4f6336a08e29f06f049c0162.jpg,"Still Image","Thornbers collection",1,0
25402,https://penninehorizons.org/items/show/25402,"Slack Chapel drawing - HCC00211","Chapel, Drawing, Slack","Slack Baptist Chapel, erected in 1808. Donated by Esther Dean",Unknown,"Esther Dean","Pennine Horizons Digital Archive",,"Esther Dean","PHDA - Horizons Community Collection","Pennine Horizons Digital Archive","TIFF file 8-bit","English (U.K.)","Documentary photograph",HCC,,,,,,,,,,,,,,,,,,,,,,,,,,,,,,,,,,,,"Chapel,Drawing,Slack",https://penninehorizons.org/files/original/322f3ebeec5c232fb00de4dcc0e56667.jpg,"Still Image","Community collection",1,0
26419,https://penninehorizons.org/items/show/26419,"Silver Street, Halifax - DPC00101","Drawing, Halifax, Horse and cart, Postcard, Shops, Silver Street, streets",,Unknown,"Dave Pearson","Pennine Horizons Digital Archive",,"Dave Pearson","PHDA - Dave Pearson Collection","Pennine Horizons Digital Archive","TIFF file 8-bit","English (U.K.)","Documentary photograph",DPC00101.tif,,,,,,,,,,,,,,,,,,,,,,,,,,,,,,,,,,,,"Drawing,Halifax,Horse and cart,Postcard,Shops,Silver Street,streets",https://penninehorizons.org/files/original/d8298dfe12d5cc27a63eb27da7636dc7.jpg,"Still Image","Dave Pearson",1,0
27167,https://penninehorizons.org/items/show/27167,"Higher Ashes Farmhouse, Todmorden - TAL00208","Drawing, Higher Ashes, Todmorden","AN 34131942",,"Todmorden Antiquarian Society","Pennine Horizons Digital Archive",,,"PHDA - Todmorden Antiquarian Society","Pennine Horizons Digital Archive","TIFF file 8-bit","English (U.K.)","Documentary photograph",TAL00208.tif,,,,,,,,,,,,,,,,,,,,,,,,,,,,,,,,,,,,"Drawing,Higher Ashes,Todmorden",https://penninehorizons.org/files/original/c3243937d307510836b296fc62afe70e.jpg,"Still Image","Todmorden Antiquarian Society Photographs at the Library",1,0
