﻿"Item Id","Item URI","Dublin Core:Title","Dublin Core:Subject","Dublin Core:Description","Dublin Core:Creator","Dublin Core:Source","Dublin Core:Publisher","Dublin Core:Date","Dublin Core:Contributor","Dublin Core:Rights","Dublin Core:Relation","Dublin Core:Format","Dublin Core:Language","Dublin Core:Type","Dublin Core:Identifier","Dublin Core:Coverage","Item Type Metadata:Lesson Plan Text","Item Type Metadata:Bibliography","Item Type Metadata:Biographical Text","Item Type Metadata:Occupation","Item Type Metadata:Death Date","Item Type Metadata:Birthplace","Item Type Metadata:Birth Date","Item Type Metadata:Participants","Item Type Metadata:Event Type","Item Type Metadata:URL","Item Type Metadata:Bit Rate/Frequency","Item Type Metadata:Interviewer","Item Type Metadata:Interviewee","Item Type Metadata:Location","Item Type Metadata:Transcription","Item Type Metadata:Local URL","Item Type Metadata:Original Format","Item Type Metadata:Physical Dimensions","Item Type Metadata:Duration","Item Type Metadata:Compression","Item Type Metadata:Producer","Item Type Metadata:Director","Item Type Metadata:Text","Item Type Metadata:Time Summary","Item Type Metadata:Email Body","Item Type Metadata:Subject Line","Item Type Metadata:From","Item Type Metadata:To","Item Type Metadata:CC","Item Type Metadata:BCC","Item Type Metadata:Number of Attachments","Item Type Metadata:Standards","Item Type Metadata:Objectives","Item Type Metadata:Materials",tags,file,itemType,collection,public,featured
12033,https://penninehorizons.org/items/show/12033,"Female Portrait - ALC03592","Female, Female_portrait, People, Portrait, Studio, Woman, Women","Written on front of picture - with kindest regards Olga",,"Pennine Horizons Digital Archive","Pennine Horizons Digital Archive","No date yet",,"PHDA - Alice Longstaff Collection","Pennine Horizons Digital Archive","TIFF file 8-bit","English (U.K.)","Documentary photograph",ALC03592.tif,,,,,,,,,,,,,,,,,,,,,,,,,,,,,,,,,,,,"Female,Female_portrait,People,Portrait,Studio,Woman,Women",https://penninehorizons.org/files/original/1fbccaf41b86e6e045b814fa2734f68e.jpg,"Still Image","Alice Longstaff - Female portraits",1,0
12034,https://penninehorizons.org/items/show/12034,"Female Portrait - ALC03593","Female, Female_portrait, Name, People, Portrait, Studio, Woman, Women",,,"Pennine Horizons Digital Archive","Pennine Horizons Digital Archive","No date yet",,"PHDA - Alice Longstaff Collection","Pennine Horizons Digital Archive","TIFF file 8-bit","English (U.K.)","Documentary photograph",ALC03593.tif,,,,,,,,,,,,,,,,,,,,,,,,,,,,,,,,,,,,"Female,Female_portrait,Name,People,Portrait,Studio,Woman,Women",https://penninehorizons.org/files/original/8cd4768a29700c208b9a871ede48e07a.jpg,"Still Image","Alice Longstaff - Female portraits",1,0
12035,https://penninehorizons.org/items/show/12035,"Female Portrait - ALC03594","Female, Female_portrait, Name, People, Portrait, Studio, Woman, Women",,,"Pennine Horizons Digital Archive","Pennine Horizons Digital Archive","No date yet",,"PHDA - Alice Longstaff Collection","Pennine Horizons Digital Archive","TIFF file 8-bit","English (U.K.)","Documentary photograph",ALC03594.tif,,,,,,,,,,,,,,,,,,,,,,,,,,,,,,,,,,,,"Female,Female_portrait,Name,People,Portrait,Studio,Woman,Women",https://penninehorizons.org/files/original/ce099a240b36c1e9fb2656ab280e400e.jpg,"Still Image","Alice Longstaff - Female portraits",1,0
12036,https://penninehorizons.org/items/show/12036,"Female Portrait - ALC03595","Female, Female_portrait, Name, People, Portrait, Studio, Woman, Women","Emma Hirst (nee Wall). Emigrated to Australia with husband and family.",,"Pennine Horizons Digital Archive","Pennine Horizons Digital Archive","No date yet",,"PHDA - Alice Longstaff Collection","Pennine Horizons Digital Archive","TIFF file 8-bit","English (U.K.)","Documentary photograph",ALC03595.tif,,,,,,,,,,,,,,,,,,,,,,,,,,,,,,,,,,,,"Female,Female_portrait,Name,People,Portrait,Studio,Woman,Women",https://penninehorizons.org/files/original/c1331d3f33903f62a7a533c9fbdb5dc1.jpg,"Still Image","Alice Longstaff - Female portraits",1,0
12037,https://penninehorizons.org/items/show/12037,"Female Portrait - ALC03596","Female, Female_portrait, Name, People, Portrait, Studio, Woman, Women","Joan Hellawell ne' Coyle",,"Pennine Horizons Digital Archive","Pennine Horizons Digital Archive","No date yet",,"PHDA - Alice Longstaff Collection","Pennine Horizons Digital Archive","TIFF file 8-bit","English (U.K.)","Documentary photograph",ALC03596.tif,,,,,,,,,,,,,,,,,,,,,,,,,,,,,,,,,,,,"Female,Female_portrait,Name,People,Portrait,Studio,Woman,Women",https://penninehorizons.org/files/original/c849f87155f3f0ca35fa5b37de7dbf3f.jpg,"Still Image","Alice Longstaff - Female portraits",1,0
12038,https://penninehorizons.org/items/show/12038,"Margaret Greenwood, nee Simpkin - ALC03599","Female, Female_portrait, People, Portrait, Woman, Women",,,"Pennine Horizons Digital Archive","Pennine Horizons Digital Archive","No date yet",,"PHDA - Alice Longstaff Collection","Pennine Horizons Digital Archive","TIFF file 8-bit","English (U.K.)","Documentary photograph",ALC03599.tif,,,,,,,,,,,,,,,,,,,,,,,,,,,,,,,,,,,,"Female,Female_portrait,People,Portrait,Woman,Women",https://penninehorizons.org/files/original/8a0e706b9adc150d70438569c0d6097c.jpg,"Still Image","Alice Longstaff - Female portraits",1,0
12039,https://penninehorizons.org/items/show/12039,"Female Portrait - ALC03600","Female, Female_portrait, People, Portrait, Woman, Women",,,"Pennine Horizons Digital Archive","Pennine Horizons Digital Archive","No date yet",,"PHDA - Alice Longstaff Collection","Pennine Horizons Digital Archive","TIFF file 8-bit","English (U.K.)","Documentary photograph",ALC03600.tif,,,,,,,,,,,,,,,,,,,,,,,,,,,,,,,,,,,,"Female,Female_portrait,People,Portrait,Woman,Women",https://penninehorizons.org/files/original/90ebd5d7240d0d9fb1995fd640ada1eb.jpg,"Still Image","Alice Longstaff - Female portraits",1,0
12040,https://penninehorizons.org/items/show/12040,"Female Portrait - ALC03601","Female, Female_portrait, People, Portrait, Woman, Women",,,"Pennine Horizons Digital Archive","Pennine Horizons Digital Archive","No date yet",,"PHDA - Alice Longstaff Collection","Pennine Horizons Digital Archive","TIFF file 8-bit","English (U.K.)","Documentary photograph",ALC03601.tif,,,,,,,,,,,,,,,,,,,,,,,,,,,,,,,,,,,,"Female,Female_portrait,People,Portrait,Woman,Women",https://penninehorizons.org/files/original/b8d7be4680845b432c7caa825ec0e2a8.jpg,"Still Image","Alice Longstaff - Female portraits",1,0
12041,https://penninehorizons.org/items/show/12041,"Female Portrait - ALC03602","Female, Female_portrait, People, Portrait, Woman, Women",,,"Pennine Horizons Digital Archive","Pennine Horizons Digital Archive","No date yet",,"PHDA - Alice Longstaff Collection","Pennine Horizons Digital Archive","TIFF file 8-bit","English (U.K.)","Documentary photograph",ALC03602.tif,,,,,,,,,,,,,,,,,,,,,,,,,,,,,,,,,,,,"Female,Female_portrait,People,Portrait,Woman,Women",https://penninehorizons.org/files/original/58a4ae46233565662cc1826379d9df00.jpg,"Still Image","Alice Longstaff - Female portraits",1,0
12042,https://penninehorizons.org/items/show/12042,"Female Portrait - ALC03603","Female, Female_portrait, People, Portrait, Woman, Women",,,"Pennine Horizons Digital Archive","Pennine Horizons Digital Archive","No date yet",,"PHDA - Alice Longstaff Collection","Pennine Horizons Digital Archive","TIFF file 8-bit","English (U.K.)","Documentary photograph",ALC03603.tif,,,,,,,,,,,,,,,,,,,,,,,,,,,,,,,,,,,,"Female,Female_portrait,People,Portrait,Woman,Women",https://penninehorizons.org/files/original/708e6ee3d7e1b6cc75c35df1904658e4.jpg,"Still Image","Alice Longstaff - Female portraits",1,0
12043,https://penninehorizons.org/items/show/12043,"Female Portrait - ALC03604","Female, Female_portrait, People, Portrait, Woman, Women",,,"Pennine Horizons Digital Archive","Pennine Horizons Digital Archive","No date yet",,"PHDA - Alice Longstaff Collection","Pennine Horizons Digital Archive","TIFF file 8-bit","English (U.K.)","Documentary photograph",ALC03604.tif,,,,,,,,,,,,,,,,,,,,,,,,,,,,,,,,,,,,"Female,Female_portrait,People,Portrait,Woman,Women",https://penninehorizons.org/files/original/69004b4e4174883217b2a59fa37d38b7.jpg,"Still Image","Alice Longstaff - Female portraits",1,0
12044,https://penninehorizons.org/items/show/12044,"Female Portrait - ALC03605","Female, Female_portrait, People, Portrait, Woman, Women",,,"Pennine Horizons Digital Archive","Pennine Horizons Digital Archive","No date yet",,"PHDA - Alice Longstaff Collection","Pennine Horizons Digital Archive","TIFF file 8-bit","English (U.K.)","Documentary photograph",ALC03605.tif,,,,,,,,,,,,,,,,,,,,,,,,,,,,,,,,,,,,"Female,Female_portrait,People,Portrait,Woman,Women",https://penninehorizons.org/files/original/f43aa1dba3ee0cb816cb49d43ebe1dc1.jpg,"Still Image","Alice Longstaff - Female portraits",1,0
12045,https://penninehorizons.org/items/show/12045,"Female Portrait - ALC03606","Female, Female_portrait, People, Portrait, Woman, Women",,,"Pennine Horizons Digital Archive","Pennine Horizons Digital Archive","No date yet",,"PHDA - Alice Longstaff Collection","Pennine Horizons Digital Archive","TIFF file 8-bit","English (U.K.)","Documentary photograph",ALC03606.tif,,,,,,,,,,,,,,,,,,,,,,,,,,,,,,,,,,,,"Female,Female_portrait,People,Portrait,Woman,Women",https://penninehorizons.org/files/original/71d3369bcd85c235b29166e3afc6f242.jpg,"Still Image","Alice Longstaff - Female portraits",1,0
12046,https://penninehorizons.org/items/show/12046,"Alice Sutcliffe - ALC03607","Female, Female_portrait, People, Portrait, Woman, Women",,,"Pennine Horizons Digital Archive","Pennine Horizons Digital Archive","No date yet",,"PHDA - Alice Longstaff Collection","Pennine Horizons Digital Archive","TIFF file 8-bit","English (U.K.)","Documentary photograph",ALC03607.tif,,,,,,,,,,,,,,,,,,,,,,,,,,,,,,,,,,,,"Female,Female_portrait,People,Portrait,Woman,Women",https://penninehorizons.org/files/original/563b6b6e2425b6534e7473fcaa9152d8.jpg,"Still Image","Alice Longstaff - Female portraits",1,0
12047,https://penninehorizons.org/items/show/12047," - ALC03608","Female, Female_portrait, People, Portrait, Woman, Women",,,"Pennine Horizons Digital Archive","Pennine Horizons Digital Archive","No date yet",,"PHDA - Alice Longstaff Collection","Pennine Horizons Digital Archive","TIFF file 8-bit","English (U.K.)","Documentary photograph",ALC03608.tif,,,,,,,,,,,,,,,,,,,,,,,,,,,,,,,,,,,,"Female,Female_portrait,People,Portrait,Woman,Women",https://penninehorizons.org/files/original/8810df9d212aa0372690283a5fb2632d.jpg,"Still Image","Alice Longstaff - Female portraits",1,0
12048,https://penninehorizons.org/items/show/12048," - ALC03609","Female, Female_portrait, People, Portrait, Woman, Women",,,"Pennine Horizons Digital Archive","Pennine Horizons Digital Archive","No date yet",,"PHDA - Alice Longstaff Collection","Pennine Horizons Digital Archive","TIFF file 8-bit","English (U.K.)","Documentary photograph",ALC03609.tif,,,,,,,,,,,,,,,,,,,,,,,,,,,,,,,,,,,,"Female,Female_portrait,People,Portrait,Woman,Women",https://penninehorizons.org/files/original/9aac203eba43f17784338ac6e97c6e84.jpg,"Still Image","Alice Longstaff - Female portraits",1,0
12049,https://penninehorizons.org/items/show/12049," - ALC03610","Female, Female_portrait, People, Portrait, Woman, Women",,,"Pennine Horizons Digital Archive","Pennine Horizons Digital Archive","No date yet",,"PHDA - Alice Longstaff Collection","Pennine Horizons Digital Archive","TIFF file 8-bit","English (U.K.)","Documentary photograph",ALC03610.tif,,,,,,,,,,,,,,,,,,,,,,,,,,,,,,,,,,,,"Female,Female_portrait,People,Portrait,Woman,Women",https://penninehorizons.org/files/original/7bccde9998df535d3000806348993036.jpg,"Still Image","Alice Longstaff - Female portraits",1,0
12050,https://penninehorizons.org/items/show/12050,"Cissie Ogden, first wife of Eric Moss - ALC03611","Female, Female_portrait, People, Portrait, Woman, Women",,,"Pennine Horizons Digital Archive","Pennine Horizons Digital Archive","No date yet",,"PHDA - Alice Longstaff Collection","Pennine Horizons Digital Archive","TIFF file 8-bit","English (U.K.)","Documentary photograph",ALC03611.tif,,,,,,,,,,,,,,,,,,,,,,,,,,,,,,,,,,,,"Female,Female_portrait,People,Portrait,Woman,Women",https://penninehorizons.org/files/original/11f6c80411620784adeabbb85301d59e.jpg,"Still Image","Alice Longstaff - Female portraits",1,0
12051,https://penninehorizons.org/items/show/12051,"Margaret Ollier - ALC03613","Female, Female_portrait, People, Portrait, Woman, Women","Alice Longstaff",,"Pennine Horizons Digital Archive","Pennine Horizons Digital Archive","No date yet",,"PHDA - Alice Longstaff Collection","Pennine Horizons Digital Archive","TIFF file 8-bit","English (U.K.)","Documentary photograph",ALC03613.tif,,,,,,,,,,,,,,,,,,,,,,,,,,,,,,,,,,,,"Female,Female_portrait,People,Portrait,Woman,Women",https://penninehorizons.org/files/original/c084c0b55dd067e39c34f79daeeceae0.jpg,"Still Image","Alice Longstaff - Female portraits",1,0
12052,https://penninehorizons.org/items/show/12052,"Female Portrait - ALC03614","Female, Female_portrait, People, Portrait, Woman, Women",,,"Pennine Horizons Digital Archive","Pennine Horizons Digital Archive","No date yet",,"PHDA - Alice Longstaff Collection","Pennine Horizons Digital Archive","TIFF file 8-bit","English (U.K.)","Documentary photograph",ALC03614.tif,,,,,,,,,,,,,,,,,,,,,,,,,,,,,,,,,,,,"Female,Female_portrait,People,Portrait,Woman,Women",https://penninehorizons.org/files/original/017677e3efe558b73e495a14fbc9c21a.jpg,"Still Image","Alice Longstaff - Female portraits",1,0
12053,https://penninehorizons.org/items/show/12053," - ALC03615","Female, Female_portrait, People, Portrait, Woman, Women",,,"Pennine Horizons Digital Archive","Pennine Horizons Digital Archive","No date yet",,"PHDA - Alice Longstaff Collection","Pennine Horizons Digital Archive","TIFF file 8-bit","English (U.K.)","Documentary photograph",ALC03615.tif,,,,,,,,,,,,,,,,,,,,,,,,,,,,,,,,,,,,"Female,Female_portrait,People,Portrait,Woman,Women",https://penninehorizons.org/files/original/7b3938c5bf60a6227024d8cdb2dae248.jpg,"Still Image","Alice Longstaff - Female portraits",1,0
12054,https://penninehorizons.org/items/show/12054,"Female Portrait - ALC03616","Female, Female_portrait, People, Portrait, Woman, Women",,,"Pennine Horizons Digital Archive","Pennine Horizons Digital Archive","No date yet",,"PHDA - Alice Longstaff Collection","Pennine Horizons Digital Archive","TIFF file 8-bit","English (U.K.)","Documentary photograph",ALC03616.tif,,,,,,,,,,,,,,,,,,,,,,,,,,,,,,,,,,,,"Female,Female_portrait,People,Portrait,Woman,Women",https://penninehorizons.org/files/original/31060086f434df9f735802810216f2d4.jpg,"Still Image","Alice Longstaff - Female portraits",1,0
12055,https://penninehorizons.org/items/show/12055,"Female Portrait - ALC03617","Female, Female_portrait, People, Portrait, Woman, Women",,,"Pennine Horizons Digital Archive","Pennine Horizons Digital Archive","No date yet",,"PHDA - Alice Longstaff Collection","Pennine Horizons Digital Archive","TIFF file 8-bit","English (U.K.)","Documentary photograph",ALC03617.tif,,,,,,,,,,,,,,,,,,,,,,,,,,,,,,,,,,,,"Female,Female_portrait,People,Portrait,Woman,Women",https://penninehorizons.org/files/original/8a52d3be2c8bc1a044ffb1802b76b704.jpg,"Still Image","Alice Longstaff - Female portraits",1,0
12056,https://penninehorizons.org/items/show/12056,"Female Portrait - ALC03618","Female, Female_portrait, People, Portrait, Woman, Women",,,"Pennine Horizons Digital Archive","Pennine Horizons Digital Archive","No date yet",,"PHDA - Alice Longstaff Collection","Pennine Horizons Digital Archive","TIFF file 8-bit","English (U.K.)","Documentary photograph",ALC03618.tif,,,,,,,,,,,,,,,,,,,,,,,,,,,,,,,,,,,,"Female,Female_portrait,People,Portrait,Woman,Women",https://penninehorizons.org/files/original/39dee544cfe742b65675e1618a48b58b.jpg,"Still Image","Alice Longstaff - Female portraits",1,0
12057,https://penninehorizons.org/items/show/12057,"Female Portrait - ALC03619","Female, Female_portrait, People, Portrait, Woman, Women",,,"Pennine Horizons Digital Archive","Pennine Horizons Digital Archive","No date yet",,"PHDA - Alice Longstaff Collection","Pennine Horizons Digital Archive","TIFF file 8-bit","English (U.K.)","Documentary photograph",ALC03619.tif,,,,,,,,,,,,,,,,,,,,,,,,,,,,,,,,,,,,"Female,Female_portrait,People,Portrait,Woman,Women",https://penninehorizons.org/files/original/cdd1e9ba62a5b6ce8ede13a90d28f609.jpg,"Still Image","Alice Longstaff - Female portraits",1,0
