﻿"Item Id","Item URI","Dublin Core:Title","Dublin Core:Subject","Dublin Core:Description","Dublin Core:Creator","Dublin Core:Source","Dublin Core:Publisher","Dublin Core:Date","Dublin Core:Contributor","Dublin Core:Rights","Dublin Core:Relation","Dublin Core:Format","Dublin Core:Language","Dublin Core:Type","Dublin Core:Identifier","Dublin Core:Coverage","Item Type Metadata:Lesson Plan Text","Item Type Metadata:Bibliography","Item Type Metadata:Biographical Text","Item Type Metadata:Occupation","Item Type Metadata:Death Date","Item Type Metadata:Birthplace","Item Type Metadata:Birth Date","Item Type Metadata:Participants","Item Type Metadata:Event Type","Item Type Metadata:URL","Item Type Metadata:Bit Rate/Frequency","Item Type Metadata:Interviewer","Item Type Metadata:Interviewee","Item Type Metadata:Location","Item Type Metadata:Transcription","Item Type Metadata:Local URL","Item Type Metadata:Original Format","Item Type Metadata:Physical Dimensions","Item Type Metadata:Duration","Item Type Metadata:Compression","Item Type Metadata:Producer","Item Type Metadata:Director","Item Type Metadata:Text","Item Type Metadata:Time Summary","Item Type Metadata:Email Body","Item Type Metadata:Subject Line","Item Type Metadata:From","Item Type Metadata:To","Item Type Metadata:CC","Item Type Metadata:BCC","Item Type Metadata:Number of Attachments","Item Type Metadata:Standards","Item Type Metadata:Objectives","Item Type Metadata:Materials",tags,file,itemType,collection,public,featured
11720,https://penninehorizons.org/items/show/11720,"Upper Blind Lane, Brearley, May 1988 - RSC00135","Brearley, Colour, Housing, Paths & Tracks, Places","This was the home of the Stell family around 1920.","Raymond Stell","Pennine Horizons Digital Archive","Pennine Horizons Digital Archive","No date yet","Raymond Stell","PHDA - Raymond Stell","Pennine Horizons Digital Archive","TIFF file 8-bit","English (U.K.)","Documentary photograph",RSC00135.tif,"Hebden Bridge",,,,,,,,,,,,,,,,,,,,,,,,,,,,,,,,,,,"Brearley,Colour,Housing,Paths & Tracks",https://penninehorizons.org/files/original/6f5e17c77f8f715f21bfd538da70f6b1.jpg,"Still Image","Raymond Stell collection ",1,0
11719,https://penninehorizons.org/items/show/11719,"Lower Blind Lane, Brearley, May 1988 - RSC00134","Brearley, Colour, Derelict, Paths & Tracks, Places","The Wadsworth hillside can be seen in the background.","Raymond Stell","Pennine Horizons Digital Archive","Pennine Horizons Digital Archive","No date yet","Raymond Stell","PHDA - Raymond Stell","Pennine Horizons Digital Archive","TIFF file 8-bit","English (U.K.)","Documentary photograph",RSC00134.tif,"Hebden Bridge",,,,,,,,,,,,,,,,,,,,,,,,,,,,,,,,,,,"Brearley,Colour,Derelict,Paths & Tracks",https://penninehorizons.org/files/original/7c8c071331af1c07fc3636ec94997501.jpg,"Still Image","Raymond Stell collection ",1,0
11718,https://penninehorizons.org/items/show/11718,"Lower Blind Lane, May 1988 - RSC00133","Architecture, Brearley, Colour, Derelict, Paths & Tracks, Places",,"Raymond Stell","Pennine Horizons Digital Archive","Pennine Horizons Digital Archive","No date yet","Raymond Stell","PHDA - Raymond Stell","Pennine Horizons Digital Archive","TIFF file 8-bit","English (U.K.)","Documentary photograph",RSC00133.tif,"Hebden Bridge",,,,,,,,,,,,,,,,,,,,,,,,,,,,,,,,,,,"Architecture,Brearley,Colour,Derelict,Paths & Tracks",https://penninehorizons.org/files/original/f1d7535c92b314e42ba2304dc8418926.jpg,"Still Image","Raymond Stell collection ",1,0
11716,https://penninehorizons.org/items/show/11716,"Sunderland House, Brearley, May 1988 - RSC00131","Architecture, Brearley, Colour, Housing, Places",,"Raymond Stell","Pennine Horizons Digital Archive","Pennine Horizons Digital Archive","No date yet","Raymond Stell","PHDA - Raymond Stell","Pennine Horizons Digital Archive","TIFF file 8-bit","English (U.K.)","Documentary photograph",RSC00131.tif,"Hebden Bridge",,,,,,,,,,,,,,,,,,,,,,,,,,,,,,,,,,,"Architecture,Brearley,Colour,Housing",https://penninehorizons.org/files/original/0dba825dc1af1655504bd66e6c98cace.jpg,"Still Image","Raymond Stell collection ",1,0
11715,https://penninehorizons.org/items/show/11715,"New Sunderland Farm, Brearley, May 1988 - RSC00130","Agricultural buildings, Agriculture, Brearley, Colour, Paths & Tracks, Places","Situated on Lower Blind Lane","Raymond Stell","Pennine Horizons Digital Archive","Pennine Horizons Digital Archive","No date yet","Raymond Stell","PHDA - Raymond Stell","Pennine Horizons Digital Archive","TIFF file 8-bit","English (U.K.)","Documentary photograph",RSC00130.tif,"Hebden Bridge",,,,,,,,,,,,,,,,,,,,,,,,,,,,,,,,,,,"Agriculture,Brearley,Colour,Paths & Tracks",https://penninehorizons.org/files/original/0ce9ec405f9cd6989db5c26a75519154.jpg,"Still Image","Raymond Stell collection ",1,0
11714,https://penninehorizons.org/items/show/11714,"Sunderland House, Brearley, May 1988 - RSC00129","Brearley, Colour, Housing, Paths & Tracks, Places",,"Raymond Stell","Pennine Horizons Digital Archive","Pennine Horizons Digital Archive","No date yet","Raymond Stell","PHDA - Raymond Stell","Pennine Horizons Digital Archive","TIFF file 8-bit","English (U.K.)","Documentary photograph",RSC00129.tif,"Hebden Bridge",,,,,,,,,,,,,,,,,,,,,,,,,,,,,,,,,,,"Brearley,Colour,Housing,Paths & Tracks",https://penninehorizons.org/files/original/84ee1a2c4facbee9aad3934c45367743.jpg,"Still Image","Raymond Stell collection ",1,0
11713,https://penninehorizons.org/items/show/11713,"Wheatley Royd, Brearley, 1988 - RSC00128","Brearley, Colour, Housing, Paths & Tracks, Places","Seen from the rear.","Raymond Stell","Pennine Horizons Digital Archive","Pennine Horizons Digital Archive","No date yet","Raymond Stell","PHDA - Raymond Stell","Pennine Horizons Digital Archive","TIFF file 8-bit","English (U.K.)","Documentary photograph",RSC00128.tif,"Hebden Bridge",,,,,,,,,,,,,,,,,,,,,,,,,,,,,,,,,,,"Brearley,Colour,Housing,Paths & Tracks",https://penninehorizons.org/files/original/694e238135b0a0c88722f4ec2a5f9b76.jpg,"Still Image","Raymond Stell collection ",1,0
11712,https://penninehorizons.org/items/show/11712,"Wheatley Royd, Brearley, 1988 - RSC00127","Architecture, Brearley, Colour, Housing, Places",,"Raymond Stell","Pennine Horizons Digital Archive","Pennine Horizons Digital Archive","No date yet","Raymond Stell","PHDA - Raymond Stell","Pennine Horizons Digital Archive","TIFF file 8-bit","English (U.K.)","Documentary photograph",RSC00127.tif,"Hebden Bridge",,,,,,,,,,,,,,,,,,,,,,,,,,,,,,,,,,,"Architecture,Brearley,Colour,Housing",https://penninehorizons.org/files/original/66ac9fc4ac332a7e07f6575170026088.jpg,"Still Image","Raymond Stell collection ",1,0
11711,https://penninehorizons.org/items/show/11711,"Riverdale, Hodgson Lane, Brearley - RSC00126","Brearley, Colour, Housing, Places",,"Raymond Stell","Pennine Horizons Digital Archive","Pennine Horizons Digital Archive","No date yet","Raymond Stell","PHDA - Raymond Stell","Pennine Horizons Digital Archive","TIFF file 8-bit","English (U.K.)","Documentary photograph",RSC00126.tif,"Hebden Bridge",,,,,,,,,,,,,,,,,,,,,,,,,,,,,,,,,,,"Brearley,Colour,Housing",https://penninehorizons.org/files/original/8a153a2a0bdb6cc87ec2e402d10cfdd6.jpg,"Still Image","Raymond Stell collection ",1,0
11710,https://penninehorizons.org/items/show/11710,"Looking down on Brearley, 1966 - RSC00125","Brearley, Churches_&_Chapels, Places, River",,"Raymond Stell","Pennine Horizons Digital Archive","Pennine Horizons Digital Archive",1960s,"Raymond Stell","PHDA - Raymond Stell","Pennine Horizons Digital Archive","TIFF file 8-bit","English (U.K.)","Documentary photograph",RSC00125.tif,"Hebden Bridge",,,,,,,,,,,,,,,,,,,,,,,,,,,,,,,,,,,"1960s,Brearley,Churches and Chapels,River",https://penninehorizons.org/files/original/9453a1e367b6c8fad2253a7e0fbcd343.jpg,"Still Image","Raymond Stell collection ",1,0
11709,https://penninehorizons.org/items/show/11709,"Rear of Bethal Terrace, Brearley, June 1987 - RSC00124","Brearley, Colour, Housing, Places",,"Raymond Stell","Pennine Horizons Digital Archive","Pennine Horizons Digital Archive","No date yet","Raymond Stell","PHDA - Raymond Stell","Pennine Horizons Digital Archive","TIFF file 8-bit","English (U.K.)","Documentary photograph",RSC00124.tif,"Hebden Bridge",,,,,,,,,,,,,,,,,,,,,,,,,,,,,,,,,,,"Brearley,Colour,Housing",https://penninehorizons.org/files/original/02c0dbdf6b78d0b4d2f18cdadec94208.jpg,"Still Image","Raymond Stell collection ",1,0
11708,https://penninehorizons.org/items/show/11708,"Bethal Terrace, Brearley, 1987 - RSC00123","Brearley, Housing, Places",,"Raymond Stell","Pennine Horizons Digital Archive","Pennine Horizons Digital Archive","No date yet","Raymond Stell","PHDA - Raymond Stell","Pennine Horizons Digital Archive","TIFF file 8-bit","English (U.K.)","Documentary photograph",RSC00123.tif,"Hebden Bridge",,,,,,,,,,,,,,,,,,,,,,,,,,,,,,,,,,,"Brearley,Housing",https://penninehorizons.org/files/original/51dfa39e34737c46c67fbd09b0a56272.jpg,"Still Image","Raymond Stell collection ",1,0
11707,https://penninehorizons.org/items/show/11707,"Brearley, June 1987 - RSC00122","Brearley, Housing, Places",,"Raymond Stell","Pennine Horizons Digital Archive","Pennine Horizons Digital Archive","No date yet","Raymond Stell","PHDA - Raymond Stell","Pennine Horizons Digital Archive","TIFF file 8-bit","English (U.K.)","Documentary photograph",RSC00122.tif,"Hebden Bridge",,,,,,,,,,,,,,,,,,,,,,,,,,,,,,,,,,,"Brearley,Housing",https://penninehorizons.org/files/original/2e9b158c94ea11298cf9aae9c5ad380e.jpg,"Still Image","Raymond Stell collection ",1,0
11706,https://penninehorizons.org/items/show/11706,"Postcard of Brearley, c1930 - RSC00121","Brearley, Buildings, Chimney, Chimneys, Hall, Mill, Places",,"Raymond Stell","Pennine Horizons Digital Archive","Pennine Horizons Digital Archive","No date yet","Raymond Stell","PHDA - Raymond Stell","Pennine Horizons Digital Archive","TIFF file 8-bit","English (U.K.)","Documentary photograph",RSC00121.tif,"Hebden Bridge",,,,,,,,,,,,,,,,,,,,,,,,,,,,,,,,,,,"Brearley,Buildings,Chimney,Chimneys,Hall,Mill",https://penninehorizons.org/files/original/93a9a34f8468caed36b081b0bef9f651.jpg,"Still Image","Raymond Stell collection ",1,0
11705,https://penninehorizons.org/items/show/11705,"Brearley, October 1st 1957 - RSC00120","Brearley, Mill, Places, River",,"Raymond Stell","Pennine Horizons Digital Archive","Pennine Horizons Digital Archive",1950s,"Raymond Stell","PHDA - Raymond Stell","Pennine Horizons Digital Archive","TIFF file 8-bit","English (U.K.)","Documentary photograph",RSC00120.tif,"Hebden Bridge",,,,,,,,,,,,,,,,,,,,,,,,,,,,,,,,,,,"1950s,Brearley,Mill,River",https://penninehorizons.org/files/original/9a5a8b361dfa7f8c3d18578f37554bb0.jpg,"Still Image","Raymond Stell collection ",1,0
11704,https://penninehorizons.org/items/show/11704,"Spring Royd, Brearley, 1988 - RSC00119","Brearley, Colour, Housing, Places",,"Raymond Stell","Pennine Horizons Digital Archive","Pennine Horizons Digital Archive","No date yet","Raymond Stell","PHDA - Raymond Stell","Pennine Horizons Digital Archive","TIFF file 8-bit","English (U.K.)","Documentary photograph",RSC00119.tif,"Hebden Bridge",,,,,,,,,,,,,,,,,,,,,,,,,,,,,,,,,,,"Brearley,Colour,Housing",https://penninehorizons.org/files/original/7a3591644bcc9e98da133faf4f9658ac.jpg,"Still Image","Raymond Stell collection ",1,0
11703,https://penninehorizons.org/items/show/11703,"Brearley Hall Courtyard, 1988 - RSC00118","Architecture, Brearley, Buildings, Colour, Hall, Places",,"Raymond Stell","Pennine Horizons Digital Archive","Pennine Horizons Digital Archive","No date yet","Raymond Stell","PHDA - Raymond Stell","Pennine Horizons Digital Archive","TIFF file 8-bit","English (U.K.)","Documentary photograph",RSC00118.tif,"Hebden Bridge",,,,,,,,,,,,,,,,,,,,,,,,,,,,,,,,,,,"Architecture,Brearley,Buildings,Colour,Hall",https://penninehorizons.org/files/original/a655ff2cc477f2fa14dbf6fcd7c07253.jpg,"Still Image","Raymond Stell collection ",1,0
11702,https://penninehorizons.org/items/show/11702,"Part of the front of Brearley Hall, 1988 - RSC00117","Architecture, Brearley, Buildings, Cat, Colour, Gardens, Hall, Places",,"Raymond Stell","Pennine Horizons Digital Archive","Pennine Horizons Digital Archive","No date yet","Raymond Stell","PHDA - Raymond Stell","Pennine Horizons Digital Archive","TIFF file 8-bit","English (U.K.)","Documentary photograph",RSC00117.tif,"Hebden Bridge",,,,,,,,,,,,,,,,,,,,,,,,,,,,,,,,,,,"Architecture,Brearley,Buildings,Cat,Colour,Gardens,Hall",https://penninehorizons.org/files/original/527d3cb7166bee64bec6e37e54195144.jpg,"Still Image","Raymond Stell collection ",1,0
11701,https://penninehorizons.org/items/show/11701,"Brearley Hall cottage, 1988 - RSC00116","Brearley, Colour, Housing, Places",,"Raymond Stell","Pennine Horizons Digital Archive","Pennine Horizons Digital Archive","No date yet","Raymond Stell","PHDA - Raymond Stell","Pennine Horizons Digital Archive","TIFF file 8-bit","English (U.K.)","Documentary photograph",RSC00116.tif,"Hebden Bridge",,,,,,,,,,,,,,,,,,,,,,,,,,,,,,,,,,,"Brearley,Colour,Housing",https://penninehorizons.org/files/original/cf25c31487ff52a6f2a20ac79321fed0.jpg,"Still Image","Raymond Stell collection ",1,0
11700,https://penninehorizons.org/items/show/11700,"Rear of Brearley Hall Cottage, 1988 - RSC00115","Brearley, Colour, Gardens, Housing, Places",,"Raymond Stell","Pennine Horizons Digital Archive","Pennine Horizons Digital Archive","No date yet","Raymond Stell","PHDA - Raymond Stell","Pennine Horizons Digital Archive","TIFF file 8-bit","English (U.K.)","Documentary photograph",RSC00115.tif,"Hebden Bridge",,,,,,,,,,,,,,,,,,,,,,,,,,,,,,,,,,,"Brearley,Colour,Gardens,Housing",https://penninehorizons.org/files/original/81e4ba2599cf6295ee7d334598d431bc.jpg,"Still Image","Raymond Stell collection ",1,0
11699,https://penninehorizons.org/items/show/11699,"Spring Farm, Brearley, 1989 - RSC00114","Brearley, Canal, Canals, Colour, Housing, Places, Transport",,"Raymond Stell","Pennine Horizons Digital Archive","Pennine Horizons Digital Archive","No date yet","Raymond Stell","PHDA - Raymond Stell","Pennine Horizons Digital Archive","TIFF file 8-bit","English (U.K.)","Documentary photograph",RSC00114.tif,"Hebden Bridge",,,,,,,,,,,,,,,,,,,,,,,,,,,,,,,,,,,"Brearley,Canal,Colour,Housing,Transport",https://penninehorizons.org/files/original/26af3e5b4e249124f6eafd8a3a4a8b25.jpg,"Still Image","Raymond Stell collection ",1,0
11698,https://penninehorizons.org/items/show/11698,"Woodleigh, Brearley, February 1989 - RSC00113","Brearley, Colour, Housing, Places",,"Raymond Stell","Pennine Horizons Digital Archive","Pennine Horizons Digital Archive","No date yet","Raymond Stell","PHDA - Raymond Stell","Pennine Horizons Digital Archive","TIFF file 8-bit","English (U.K.)","Documentary photograph",RSC00113.tif,"Hebden Bridge",,,,,,,,,,,,,,,,,,,,,,,,,,,,,,,,,,,"Brearley,Colour,Housing",https://penninehorizons.org/files/original/5e3edc4385129620c6f34ffe40454340.jpg,"Still Image","Raymond Stell collection ",1,0
11697,https://penninehorizons.org/items/show/11697,"Spring House, Brearley, 1988 - RSC00112","Brearley, Colour, Housing, Places",,"Raymond Stell","Pennine Horizons Digital Archive","Pennine Horizons Digital Archive","No date yet","Raymond Stell","PHDA - Raymond Stell","Pennine Horizons Digital Archive","TIFF file 8-bit","English (U.K.)","Documentary photograph",RSC00112.tif,"Hebden Bridge",,,,,,,,,,,,,,,,,,,,,,,,,,,,,,,,,,,"Brearley,Colour,Housing",https://penninehorizons.org/files/original/94de27fe4b6267392810bfcbf5a83d5c.jpg,"Still Image","Raymond Stell collection ",1,0
11696,https://penninehorizons.org/items/show/11696,"Grove Inn, Brampton, Brearley, 1988 - RSC00111","Architecture, Brearley, Buildings, Colour, Places, Public Houses, Pubs Inns & Hotels, Taverns",,"Raymond Stell","Pennine Horizons Digital Archive","Pennine Horizons Digital Archive","No date yet","Raymond Stell","PHDA - Raymond Stell","Pennine Horizons Digital Archive","TIFF file 8-bit","English (U.K.)","Documentary photograph",RSC00111.tif,"Hebden Bridge",,,,,,,,,,,,,,,,,,,,,,,,,,,,,,,,,,,"#Pub,Architecture,Brearley,Buildings,Colour,Public Houses,Pubs Inns and Hotels,Taverns",https://penninehorizons.org/files/original/4e3c1f1397e771867c8f9bb0e9587c13.jpg,"Still Image","Raymond Stell collection ",1,0
11695,https://penninehorizons.org/items/show/11695,"Greenfield, Brearley, 1987 - RSC00110","Architecture, Brearley, Colour, Housing, Places",,"Raymond Stell","Pennine Horizons Digital Archive","Pennine Horizons Digital Archive","No date yet","Raymond Stell","PHDA - Raymond Stell","Pennine Horizons Digital Archive","TIFF file 8-bit","English (U.K.)","Documentary photograph",RSC00110.tif,"Hebden Bridge",,,,,,,,,,,,,,,,,,,,,,,,,,,,,,,,,,,"Architecture,Brearley,Colour,Housing",https://penninehorizons.org/files/original/ce6aa94843551598c4ab717efd38eb6f.jpg,"Still Image","Raymond Stell collection ",1,0
