﻿"Item Id","Item URI","Dublin Core:Title","Dublin Core:Subject","Dublin Core:Description","Dublin Core:Creator","Dublin Core:Source","Dublin Core:Publisher","Dublin Core:Date","Dublin Core:Contributor","Dublin Core:Rights","Dublin Core:Relation","Dublin Core:Format","Dublin Core:Language","Dublin Core:Type","Dublin Core:Identifier","Dublin Core:Coverage","Item Type Metadata:Lesson Plan Text","Item Type Metadata:Bibliography","Item Type Metadata:Biographical Text","Item Type Metadata:Occupation","Item Type Metadata:Death Date","Item Type Metadata:Birthplace","Item Type Metadata:Birth Date","Item Type Metadata:Participants","Item Type Metadata:Event Type","Item Type Metadata:URL","Item Type Metadata:Bit Rate/Frequency","Item Type Metadata:Interviewer","Item Type Metadata:Interviewee","Item Type Metadata:Location","Item Type Metadata:Transcription","Item Type Metadata:Local URL","Item Type Metadata:Original Format","Item Type Metadata:Physical Dimensions","Item Type Metadata:Duration","Item Type Metadata:Compression","Item Type Metadata:Producer","Item Type Metadata:Director","Item Type Metadata:Text","Item Type Metadata:Time Summary","Item Type Metadata:Email Body","Item Type Metadata:Subject Line","Item Type Metadata:From","Item Type Metadata:To","Item Type Metadata:CC","Item Type Metadata:BCC","Item Type Metadata:Number of Attachments","Item Type Metadata:Standards","Item Type Metadata:Objectives","Item Type Metadata:Materials",tags,file,itemType,collection,public,featured
10562,https://penninehorizons.org/items/show/10562,"Holt's Picker Works, Eastwood, c1930 - MOT00231","Buildings, Engineering, Interior, Mill, Mills, People, People at Work","In the centre is Arnold Knight who lived nearby at Callis Bridge. Arnold was laid off in 1934 because of the trade depression caused by the Wall Street crash. Information supplied by his grandson Jonathan Greenwood.",,"Todmorden Information Centre Trust","Pennine Horizons Digital Archive",1930s,"Roger Birch","PHDA - Todmorden Information Centre Trust","Pennine Horizons Digital Archive","TIFF file 8-bit","English (U.K.)","Documentary photograph",MOT00231.tif,Todmorden,,,,,,,,,,,,,,,,,,,,,,,,,,,,,,,,,,,"Buildings,Engineering,Interior,Mill,Mills,People,People at Work",https://penninehorizons.org/files/original/1400443e88c04facea813960a8b5bfd4.jpg,"Still Image","The Making of Todmorden exhibition",1,0
5079,https://penninehorizons.org/items/show/5079,"Inside the Graham & Normanton factory - DEP00254","Engineering, Machinery","Lathe bed being machined on a planeing machine",Unknown,"Pennine Horizons Digital Archive","Pennine Horizons Digital Archive","No date yet","Derek Pollard","PHDA - Derek Pollard Collection","Pennine Horizons Digital Archive","TIFF file 8-bit","English (U.K.)","Documentary photograph",DEP00254.tif,,,,,,,,,,,,,,,,,,,,,,,,,,,,,,,,,,,,"Engineering,Machinery",https://penninehorizons.org/files/original/966afdfe10cf48b8c0c7c2ec725efe2d.jpg,"Still Image","Derek Pollard collection",1,0
4952,https://penninehorizons.org/items/show/4952,"John Pickles & Son, Mytholm - DEP00127","Buildings, Engineering, Interior, Machinery, Mill, Mills, Mytholm, Places","View from fitting shop into a machine shop. The drawing office can be seen through the glass window, note the heating pipes in the roof truss.",Unknown,"Pennine Horizons Digital Archive","Pennine Horizons Digital Archive","No date yet","Derek Pollard","PHDA - Derek Pollard Collection","Pennine Horizons Digital Archive","TIFF file 8-bit","English (U.K.)","Documentary photograph",DEP00127.tif,,,,,,,,,,,,,,,,,,,,,,,,,,,,,,,,,,,,"Buildings,Engineering,Interior,Machinery,Mill,Mills,Mytholm",https://penninehorizons.org/files/original/c333849d2f2a1198ec60d064efe658b3.jpg,"Still Image","Derek Pollard collection",1,0
4953,https://penninehorizons.org/items/show/4953,"John Pickles & Son, Mytholm - DEP00128","Buildings, Engineering, Interior, Machinery, Mill, Mills, Mytholm, Places","Horizontal log bandsaw.",Unknown,"Pennine Horizons Digital Archive","Pennine Horizons Digital Archive","No date yet","Derek Pollard","PHDA - Derek Pollard Collection","Pennine Horizons Digital Archive","TIFF file 8-bit","English (U.K.)","Documentary photograph",DEP00128.tif,,,,,,,,,,,,,,,,,,,,,,,,,,,,,,,,,,,,"Buildings,Engineering,Interior,Machinery,Mill,Mills,Mytholm",https://penninehorizons.org/files/original/2d8b7900bd864562151a6318f1214a35.jpg,"Still Image","Derek Pollard collection",1,0
4954,https://penninehorizons.org/items/show/4954,"John Pickles & Son, Mytholm - DEP00129","Buildings, Engineering, Interior, Machinery, Mill, Mills","Double ended tenoning machine in fitting shop, looking toward the old mill bottom.",Unknown,"Pennine Horizons Digital Archive","Pennine Horizons Digital Archive","No date yet","Derek Pollard","PHDA - Derek Pollard Collection","Pennine Horizons Digital Archive","TIFF file 8-bit","English (U.K.)","Documentary photograph",DEP00129.tif,,,,,,,,,,,,,,,,,,,,,,,,,,,,,,,,,,,,"Buildings,Engineering,Interior,Machinery,Mill,Mills",https://penninehorizons.org/files/original/38996c6a2c18d631d6fe186266baf187.jpg,"Still Image","Derek Pollard collection",1,0
4955,https://penninehorizons.org/items/show/4955,"John Pickles & Son, Mytholm - DEP00130","Buildings, Engineering, Interior, Machinery, Mill, Mills","c1935. Vertical log saw, here it was in the fitting shop, after building extension it became the machine shop.",Unknown,"Pennine Horizons Digital Archive","Pennine Horizons Digital Archive",1930s,"Derek Pollard","PHDA - Derek Pollard Collection","Pennine Horizons Digital Archive","TIFF file 8-bit","English (U.K.)","Documentary photograph",DEP00130.tif,,,,,,,,,,,,,,,,,,,,,,,,,,,,,,,,,,,,"Buildings,Engineering,Interior,Machinery,Mill,Mills",https://penninehorizons.org/files/original/1c11d87b9b3098b7aacbc64226d5724b.jpg,"Still Image","Derek Pollard collection",1,0
4957,https://penninehorizons.org/items/show/4957,"John Pickles & Son, Mytholm - DEP00132","Buildings, Engineering, Interior, Machinery, Mill, Mills, Mytholm, People, People at Work","c1967, a gang chain morticer. Wilie Cole.",Unknown,"Pennine Horizons Digital Archive","Pennine Horizons Digital Archive","1960s, 1967","Derek Pollard","PHDA - Derek Pollard Collection","Pennine Horizons Digital Archive","TIFF file 8-bit","English (U.K.)","Documentary photograph",DEP00132.tif,,,,,,,,,,,,,,,,,,,,,,,,,,,,,,,,,,,,"Buildings,Engineering,Interior,Machinery,Mill,Mills,Mytholm,People,People at Work",https://penninehorizons.org/files/original/819bfcc6932c3a155821d82f5279d763.jpg,"Still Image","Derek Pollard collection",1,0
4958,https://penninehorizons.org/items/show/4958,"John Pickles & Son, Mytholm - DEP00133","Buildings, Engineering, Interior, Machinery, Mill, Mills, Mytholm, People, People at Work","Derek Pollard on left, Roy Baker on right, both fitters working on a two drum sanding machine. In background is the centre lathe turning department. Roy later became the dynamite worker on the building of the M62.",Unknown,"Pennine Horizons Digital Archive","Pennine Horizons Digital Archive","No date yet","Derek Pollard","PHDA - Derek Pollard Collection","Pennine Horizons Digital Archive","TIFF file 8-bit","English (U.K.)","Documentary photograph",DEP00133.tif,,,,,,,,,,,,,,,,,,,,,,,,,,,,,,,,,,,,"Buildings,Engineering,Interior,Machinery,Mill,Mills,Mytholm,People,People at Work",https://penninehorizons.org/files/original/4b52a9ffee02bbe55e522348413edc53.jpg,"Still Image","Derek Pollard collection",1,0
4959,https://penninehorizons.org/items/show/4959,"John Pickles & Son, Mytholm - DEP00134","Buildings, Engineering, Interior, Mill, Mills, Mytholm, Places","Vertical bandsaw, part of machine shop, and old mill bottom in the background.",Unknown,"Pennine Horizons Digital Archive","Pennine Horizons Digital Archive","No date yet","Derek Pollard","PHDA - Derek Pollard Collection","Pennine Horizons Digital Archive","TIFF file 8-bit","English (U.K.)","Documentary photograph",DEP00134.tif,,,,,,,,,,,,,,,,,,,,,,,,,,,,,,,,,,,,"Buildings,Engineering,Interior,Mill,Mills,Mytholm",https://penninehorizons.org/files/original/5c0e9ba3bedbf671b452330e94f571a3.jpg,"Still Image","Derek Pollard collection",1,0
4960,https://penninehorizons.org/items/show/4960,"John Pickles & Son, Mytholm - DEP00135","Buildings, Engineering, Interior, Machinery, Mill, Mills, Mytholm, Places","Large planing machine for Mersey Docks and Harbour Board for making lock gates, in fitting shop looking towards old mill bottom. Eric Warrington and Herbert Ellison are both in the picture.",Unknown,"Pennine Horizons Digital Archive","Pennine Horizons Digital Archive","No date yet","Derek Pollard","PHDA - Derek Pollard Collection","Pennine Horizons Digital Archive","TIFF file 8-bit","English (U.K.)","Documentary photograph",DEP00135.tif,,,,,,,,,,,,,,,,,,,,,,,,,,,,,,,,,,,,"Buildings,Engineering,Interior,Machinery,Mill,Mills,Mytholm",https://penninehorizons.org/files/original/5e31961bcc876b9b6961030c7c8cd925.jpg,"Still Image","Derek Pollard collection",1,0
4961,https://penninehorizons.org/items/show/4961,"John Pickles & Son, Mytholm - DEP00136","Buildings, Engineering, Interior, Machinery, Mill, Mills, Mytholm, People, People at Work, Places","Machine/fitting shop. See the big crane, the driver was John Cockroft whose father was the architect of the trestle bridge at Blake Dean.",Unknown,"Pennine Horizons Digital Archive","Pennine Horizons Digital Archive","No date yet","Derek Pollard","PHDA - Derek Pollard Collection","Pennine Horizons Digital Archive","TIFF file 8-bit","English (U.K.)","Documentary photograph",DEP00136.tif,,,,,,,,,,,,,,,,,,,,,,,,,,,,,,,,,,,,"Buildings,Engineering,Interior,Machinery,Mill,Mills,Mytholm,People,People at Work",https://penninehorizons.org/files/original/d4f385bf02042a27e928d6c4d0a6ea92.jpg,"Still Image","Derek Pollard collection",1,0
4962,https://penninehorizons.org/items/show/4962,"John Pickles & Son, Mytholm - DEP00137","Buildings, Engineering, Interior, Machinery, Mill, Mills","Horizontal log bandsaw in fitting shop. c1950",Unknown,"Pennine Horizons Digital Archive","Pennine Horizons Digital Archive","No date yet","Derek Pollard","PHDA - Derek Pollard Collection","Pennine Horizons Digital Archive","TIFF file 8-bit","English (U.K.)","Documentary photograph",DEP00137.tif,,,,,,,,,,,,,,,,,,,,,,,,,,,,,,,,,,,,"Buildings,Engineering,Interior,Machinery,Mill,Mills",https://penninehorizons.org/files/original/de77a7640ce00bcb75f4b41abf54df9c.jpg,"Still Image","Derek Pollard collection",1,0
4963,https://penninehorizons.org/items/show/4963,"John Pickles & Son, Mytholm - DEP00138","Buildings, Engineering, Interior, Mill, Mills, Mytholm, Places","Double ending tenoning machine in fitting shop",Unknown,"Pennine Horizons Digital Archive","Pennine Horizons Digital Archive","No date yet","Derek Pollard","PHDA - Derek Pollard Collection","Pennine Horizons Digital Archive","TIFF file 8-bit","English (U.K.)","Documentary photograph",DEP00138.tif,,,,,,,,,,,,,,,,,,,,,,,,,,,,,,,,,,,,"Buildings,Engineering,Interior,Mill,Mills,Mytholm",https://penninehorizons.org/files/original/c1dd69c705fd025c85a2d6b208cefa61.jpg,"Still Image","Derek Pollard collection",1,0
4964,https://penninehorizons.org/items/show/4964,"John Pickles & Son, Mytholm - DEP00139","Buildings, Engineering, Interior, Machinery, Mill, Mills, Mytholm","Veneer peeler",Unknown,"Pennine Horizons Digital Archive","Pennine Horizons Digital Archive","No date yet","Derek Pollard","PHDA - Derek Pollard Collection","Pennine Horizons Digital Archive","TIFF file 8-bit","English (U.K.)","Documentary photograph",DEP00139.tif,,,,,,,,,,,,,,,,,,,,,,,,,,,,,,,,,,,,"Buildings,Engineering,Interior,Machinery,Mill,Mills,Mytholm",https://penninehorizons.org/files/original/4e6d2c895cf91d1fe50fba5dac5e18c1.jpg,"Still Image","Derek Pollard collection",1,0
4965,https://penninehorizons.org/items/show/4965,"John Pickles & Son, Mytholm - DEP00140","Buildings, Engineering, Machinery, Mill, Mills","Saw sharpening and setting machine",Unknown,"Pennine Horizons Digital Archive","Pennine Horizons Digital Archive","No date yet","Derek Pollard","PHDA - Derek Pollard Collection","Pennine Horizons Digital Archive","TIFF file 8-bit","English (U.K.)","Documentary photograph",DEP00140.tif,,,,,,,,,,,,,,,,,,,,,,,,,,,,,,,,,,,,"Buildings,Engineering,Machinery,Mill,Mills",https://penninehorizons.org/files/original/652767d31243e9c7d2ad7b064095474e.jpg,"Still Image","Derek Pollard collection",1,0
4966,https://penninehorizons.org/items/show/4966,"John Pickles & Son, Mytholm - DEP00141","Buildings, Engineering, Interior, Machinery, Mill, Mills, Mytholm, People, People at Work, Places","Large planing machine for long beam, mqade for the Mercy docks and Harbour Board. Herbert Ellison and Eric Warrington, on left , Albert Cockroft with his back to the camera. c 1961",Unknown,"Pennine Horizons Digital Archive","Pennine Horizons Digital Archive","No date yet","Derek Pollard","PHDA - Derek Pollard Collection","Pennine Horizons Digital Archive","TIFF file 8-bit","English (U.K.)","Documentary photograph",DEP00141.tif,,,,,,,,,,,,,,,,,,,,,,,,,,,,,,,,,,,,"Buildings,Engineering,Interior,Machinery,Mill,Mills,Mytholm,People,People at Work",https://penninehorizons.org/files/original/7484208f171cc0c98e489e5842f5cdbd.jpg,"Still Image","Derek Pollard collection",1,0
4967,https://penninehorizons.org/items/show/4967,"John Pickles & Son, Mytholm - DEP00142","Buildings, Engineering, Interior, Machinery, Mill, Mills, Mytholm, Places","Machine for head rounding and bevelling barrel lids, in the packing bay.",Unknown,"Pennine Horizons Digital Archive","Pennine Horizons Digital Archive","No date yet","Derek Pollard","PHDA - Derek Pollard Collection","Pennine Horizons Digital Archive","TIFF file 8-bit","English (U.K.)","Documentary photograph",DEP00142.tif,,,,,,,,,,,,,,,,,,,,,,,,,,,,,,,,,,,,"Buildings,Engineering,Interior,Machinery,Mill,Mills,Mytholm",https://penninehorizons.org/files/original/f179ff2e4be60888466305d92cad9c0e.jpg,"Still Image","Derek Pollard collection",1,0
4968,https://penninehorizons.org/items/show/4968,"John Pickles & Son, Mytholm - DEP00143","Buildings, Engineering, Interior, Machinery, Mill, Mills, Mytholm, People, People at Work, Places","Multi spindle moulder, used for making skirting boards etc. Douglas Parker holding the sheet.",Unknown,"Pennine Horizons Digital Archive","Pennine Horizons Digital Archive","No date yet","Derek Pollard","PHDA - Derek Pollard Collection","Pennine Horizons Digital Archive","TIFF file 8-bit","English (U.K.)","Documentary photograph",DEP00143.tif,,,,,,,,,,,,,,,,,,,,,,,,,,,,,,,,,,,,"Buildings,Engineering,Interior,Machinery,Mill,Mills,Mytholm,People,People at Work",https://penninehorizons.org/files/original/a9060990fb92f8ce56c4f93e7d4cecfc.jpg,"Still Image","Derek Pollard collection",1,0
4969,https://penninehorizons.org/items/show/4969,"John Pickles & Son, Mytholm - DEP00144","Buildings, Engineering, Interior, Machinery, Mill, Mills, Mytholm, Places","Machine in fitting bay,  the despatch bay is in the background",Unknown,"Pennine Horizons Digital Archive","Pennine Horizons Digital Archive","No date yet","Derek Pollard","PHDA - Derek Pollard Collection","Pennine Horizons Digital Archive","TIFF file 8-bit","English (U.K.)","Documentary photograph",DEP00144.tif,,,,,,,,,,,,,,,,,,,,,,,,,,,,,,,,,,,,"Buildings,Engineering,Interior,Machinery,Mill,Mills,Mytholm",https://penninehorizons.org/files/original/8b67a1378ddb945e61505d3561642060.jpg,"Still Image","Derek Pollard collection",1,0
10603,https://penninehorizons.org/items/show/10603,"Lifeboat Saturday Parade - MOT00290","Animals, Demonstration, Engineering, Event, Events, Horses and Ponies, Machinery, Parade, People, People at Leisure, Procession","Aston and Barker's  wagon is paraded through the town in the Lifeboat Saturday procession on 7th July 1906",Unknown,"Todmorden Information Centre Trust","Pennine Horizons Digital Archive","1906, 1900s","Roger Birch","PHDA - Todmorden Information Centre Trust","Pennine Horizons Digital Archive","TIFF file 8-bit","English (U.K.)","Documentary photograph",MOT00290.tif,Todmorden,,,,,,,,,,,,,,,,,,,,,,,,,,,,,,,,,,,"Animals,Demonstration,Engineering,Event,Events,Horse,Horses and Ponies,Machinery,Parade,People,People at Leisure,Procession",https://penninehorizons.org/files/original/16b368b8a2d9547ec56edd18d6fe42a1.jpg,"Still Image","The Making of Todmorden exhibition",1,0
10612,https://penninehorizons.org/items/show/10612,"Lord Bros.  Textile Machinery, Canal Street Works. - MOT00303","Drawing, Engineering","An illustration of the Lord Bros site, showing Stackhills Road and Baltimore in the foreground.",,"Todmorden Information Centre Trust","Pennine Horizons Digital Archive","No date yet","Roger Birch","PHDA - Todmorden Information Centre Trust","Pennine Horizons Digital Archive","TIFF file 8-bit","English (U.K.)","Documentary photograph",MOT00303.tif,Todmorden,,,,,,,,,,,,,,,,,,,,,,,,,,,,,,,,,,,"Drawing,Engineering",https://penninehorizons.org/files/original/2098487a3072b79ab89dfd21176eb000.jpg,"Still Image","The Making of Todmorden exhibition",1,0
10613,https://penninehorizons.org/items/show/10613,"Lord Bros.  Textile Machinery, Canal Street Works. - MOT00304",Engineering,,,"Todmorden Information Centre Trust","Pennine Horizons Digital Archive","No date yet","Roger Birch","PHDA - Todmorden Information Centre Trust","Pennine Horizons Digital Archive","TIFF file 8-bit","English (U.K.)","Documentary photograph",MOT00304.tif,Todmorden,,,,,,,,,,,,,,,,,,,,,,,,,,,,,,,,,,,Engineering,https://penninehorizons.org/files/original/ac96f51e70b29476edc3aadd77c6af4c.jpg,"Still Image","The Making of Todmorden exhibition",1,0
10614,https://penninehorizons.org/items/show/10614,"Lord Bros.  Textile Machinery, Canal Street Works. - MOT00305","Engineering, Portrait","Edward Lord, 1st March 1812 - 10th September 1875. He was a pioneer in the manufacture of cotton spinning machinery and the founder of the firm.",Unknown,"Todmorden Information Centre Trust","Pennine Horizons Digital Archive","No date yet","Roger Birch","PHDA - Todmorden Information Centre Trust","Pennine Horizons Digital Archive","TIFF file 8-bit","English (U.K.)","Documentary photograph",MOT00305.tif,Todmorden,,,,,,,,,,,,,,,,,,,,,,,,,,,,,,,,,,,"Engineering,Portrait",https://penninehorizons.org/files/original/3d4a521a7e85c26112e8ce9d79b98dcb.jpg,"Still Image","The Making of Todmorden exhibition",1,0
10615,https://penninehorizons.org/items/show/10615,"Lord Bros.  Textile Machinery, Canal Street Works. - MOT00306","Buildings, Engineering, Interior, Machinery, Mill, Mills, People, People at Work","The engineering workshop in the Canal Street works.",Unknown,"Todmorden Information Centre Trust","Pennine Horizons Digital Archive","No date yet","Roger Birch","PHDA - Todmorden Information Centre Trust","Pennine Horizons Digital Archive","TIFF file 8-bit","English (U.K.)","Documentary photograph",MOT00306.tif,Todmorden,,,,,,,,,,,,,,,,,,,,,,,,,,,,,,,,,,,"Buildings,Engineering,Interior,Machinery,Mill,Mills,People,People at Work",https://penninehorizons.org/files/original/59ec9dd1dbeec291480a263122b5e17e.jpg,"Still Image","The Making of Todmorden exhibition",1,0
10616,https://penninehorizons.org/items/show/10616,"Lord Bros.  Textile Machinery, Canal Street Works. - MOT00307","Buildings, Engineering, Interior, Machinery, Mill, Mills, People, People at Work","Interior view of the packing department on the Baltimore site.",Unknown,"Todmorden Information Centre Trust","Pennine Horizons Digital Archive","1905, 1900s","Roger Birch","PHDA - Todmorden Information Centre Trust","Pennine Horizons Digital Archive","TIFF file 8-bit","English (U.K.)","Documentary photograph",MOT00307.tif,Todmorden,,,,,,,,,,,,,,,,,,,,,,,,,,,,,,,,,,,"Buildings,Engineering,Interior,Machinery,Mill,Mills,People,People at Work",https://penninehorizons.org/files/original/39b75578273d9c3e32e55fc049080f29.jpg,"Still Image","The Making of Todmorden exhibition",1,0
