﻿"Item Id","Item URI","Dublin Core:Title","Dublin Core:Subject","Dublin Core:Description","Dublin Core:Creator","Dublin Core:Source","Dublin Core:Publisher","Dublin Core:Date","Dublin Core:Contributor","Dublin Core:Rights","Dublin Core:Relation","Dublin Core:Format","Dublin Core:Language","Dublin Core:Type","Dublin Core:Identifier","Dublin Core:Coverage","Item Type Metadata:Lesson Plan Text","Item Type Metadata:Bibliography","Item Type Metadata:Biographical Text","Item Type Metadata:Occupation","Item Type Metadata:Death Date","Item Type Metadata:Birthplace","Item Type Metadata:Birth Date","Item Type Metadata:Participants","Item Type Metadata:Event Type","Item Type Metadata:URL","Item Type Metadata:Bit Rate/Frequency","Item Type Metadata:Interviewer","Item Type Metadata:Interviewee","Item Type Metadata:Location","Item Type Metadata:Transcription","Item Type Metadata:Local URL","Item Type Metadata:Original Format","Item Type Metadata:Physical Dimensions","Item Type Metadata:Duration","Item Type Metadata:Compression","Item Type Metadata:Producer","Item Type Metadata:Director","Item Type Metadata:Text","Item Type Metadata:Time Summary","Item Type Metadata:Email Body","Item Type Metadata:Subject Line","Item Type Metadata:From","Item Type Metadata:To","Item Type Metadata:CC","Item Type Metadata:BCC","Item Type Metadata:Number of Attachments","Item Type Metadata:Standards","Item Type Metadata:Objectives","Item Type Metadata:Materials",tags,file,itemType,collection,public,featured
27139,https://penninehorizons.org/items/show/27139,"Demolition of Todmorden Co-op, Dale Street, Todmorden, 2000 - TAL00180","Building, Co-op Building, Co-operative Movement, Demolition, Todmorden","AN 34131981",,"Todmorden Antiquarian Society","Pennine Horizons Digital Archive",2000,,"PHDA - Todmorden Antiquarian Society","Pennine Horizons Digital Archive","TIFF file 8-bit","English (U.K.)","Documentary photograph",TAL00180.tif,,,,,,,,,,,,,,,,,,,,,,,,,,,,,,,,,,,,"Building,Co-op Building,Co-operative Movement,Demolition,Todmorden",https://penninehorizons.org/files/original/f95944caec3562820e18d29614d0fd99.jpg,"Still Image","Todmorden Antiquarian Society Photographs at the Library",1,0
27138,https://penninehorizons.org/items/show/27138,"Demolition of Todmorden Co-op, Dale Street, Todmorden, 2000 - TAL00177","Building, Co-op Building, Co-operative Movement, Demolition, Todmorden","AN 34131981",,"Todmorden Antiquarian Society","Pennine Horizons Digital Archive",2000,,"PHDA - Todmorden Antiquarian Society","Pennine Horizons Digital Archive","TIFF file 8-bit","English (U.K.)","Documentary photograph",TAL00177.tif,,,,,,,,,,,,,,,,,,,,,,,,,,,,,,,,,,,,"Building,Co-op Building,Co-operative Movement,Demolition,Todmorden",https://penninehorizons.org/files/original/65cfa990d0f5b0362f5962b151a6b7b9.jpg,"Still Image","Todmorden Antiquarian Society Photographs at the Library",1,0
27137,https://penninehorizons.org/items/show/27137,"Demolition of Todmorden Co-op, Dale Street, Todmorden, 2000 - TAL00176","Building, Co-op Building, Co-operative Movement, Demolition, Todmorden","AN 34131981",,"Todmorden Antiquarian Society","Pennine Horizons Digital Archive",2000,,"PHDA - Todmorden Antiquarian Society","Pennine Horizons Digital Archive","TIFF file 8-bit","English (U.K.)","Documentary photograph",TAL00176.tif,,,,,,,,,,,,,,,,,,,,,,,,,,,,,,,,,,,,"Building,Co-op Building,Co-operative Movement,Demolition,Todmorden",https://penninehorizons.org/files/original/397f7149c8c24f1606b24bc4e9aa991a.jpg,"Still Image","Todmorden Antiquarian Society Photographs at the Library",1,0
27136,https://penninehorizons.org/items/show/27136,"Demolition of Todmorden Co-op, Dale Street, Todmorden, 2000 - TAL00175","Building, Co-op Building, Co-operative Movement, Demolition, Todmorden","AN 34131981",,"Todmorden Antiquarian Society","Pennine Horizons Digital Archive",2000,,"PHDA - Todmorden Antiquarian Society","Pennine Horizons Digital Archive","TIFF file 8-bit","English (U.K.)","Documentary photograph",TAL00175.tif,,,,,,,,,,,,,,,,,,,,,,,,,,,,,,,,,,,,"Building,Co-op Building,Co-operative Movement,Demolition,Todmorden",https://penninehorizons.org/files/original/b15c5f7a1f2088b20e31ad5034f33a66.jpg,"Still Image","Todmorden Antiquarian Society Photographs at the Library",1,0
27135,https://penninehorizons.org/items/show/27135,"Demolition of Todmorden Co-op, Dale Street, Todmorden, 2000 - TAL00174","Building, Co-op Building, Co-operative Movement, Demolition, Todmorden","AN 34131981",,"Todmorden Antiquarian Society","Pennine Horizons Digital Archive",2000,,"PHDA - Todmorden Antiquarian Society","Pennine Horizons Digital Archive","TIFF file 8-bit","English (U.K.)","Documentary photograph",TAL00174.tif,,,,,,,,,,,,,,,,,,,,,,,,,,,,,,,,,,,,"Building,Co-op Building,Co-operative Movement,Demolition,Todmorden",https://penninehorizons.org/files/original/42453275d0467eb00c59ceba9a868109.jpg,"Still Image","Todmorden Antiquarian Society Photographs at the Library",1,0
27134,https://penninehorizons.org/items/show/27134,"Demolition of Todmorden Co-op, Dale Street, Todmorden, 2000 - TAL00173","Building, Co-op Building, Co-operative Movement, Demolition, Todmorden","AN 34131981",,"Todmorden Antiquarian Society","Pennine Horizons Digital Archive",2000,,"PHDA - Todmorden Antiquarian Society","Pennine Horizons Digital Archive","TIFF file 8-bit","English (U.K.)","Documentary photograph",TAL00173.tif,,,,,,,,,,,,,,,,,,,,,,,,,,,,,,,,,,,,"Building,Co-op Building,Co-operative Movement,Demolition,Todmorden",https://penninehorizons.org/files/original/9ba03bdcaf1cfff923a17709e4be8a03.jpg,"Still Image","Todmorden Antiquarian Society Photographs at the Library",1,0
27133,https://penninehorizons.org/items/show/27133,"Demolition of Todmorden Co-op, Dale Street, Todmorden, 2000 - TAL00172","Building, Co-op Building, Co-operative Movement, Demolition, Todmorden","AN 34131981",,"Todmorden Antiquarian Society","Pennine Horizons Digital Archive",2000,,"PHDA - Todmorden Antiquarian Society","Pennine Horizons Digital Archive","TIFF file 8-bit","English (U.K.)","Documentary photograph",TAL00172.tif,,,,,,,,,,,,,,,,,,,,,,,,,,,,,,,,,,,,"Building,Co-op Building,Co-operative Movement,Demolition,Todmorden",https://penninehorizons.org/files/original/2205459353439a5bd3f7dfad8287ff03.jpg,"Still Image","Todmorden Antiquarian Society Photographs at the Library",1,0
27132,https://penninehorizons.org/items/show/27132,"Demolition of Todmorden Co-op, Dale Street, Todmorden, 2000 - TAL00171","Building, Co-op Building, Co-operative Movement, Demolition, Todmorden","AN 34131981",,"Todmorden Antiquarian Society","Pennine Horizons Digital Archive",2000,,"PHDA - Todmorden Antiquarian Society","Pennine Horizons Digital Archive","TIFF file 8-bit","English (U.K.)","Documentary photograph",TAL00171.tif,,,,,,,,,,,,,,,,,,,,,,,,,,,,,,,,,,,,"Building,Co-op Building,Co-operative Movement,Demolition,Todmorden",https://penninehorizons.org/files/original/282dde86d04ba7d3cc37d58788518bdc.jpg,"Still Image","Todmorden Antiquarian Society Photographs at the Library",1,0
27131,https://penninehorizons.org/items/show/27131,"Demolition of Todmorden Co-op, Dale Street, Todmorden, 2000 - TAL00170","Building, Co-op Building, Co-operative Movement, Demolition, Todmorden","AN 34131981",,"Todmorden Antiquarian Society","Pennine Horizons Digital Archive",2000,,"PHDA - Todmorden Antiquarian Society","Pennine Horizons Digital Archive","TIFF file 8-bit","English (U.K.)","Documentary photograph",TAL00170.tif,,,,,,,,,,,,,,,,,,,,,,,,,,,,,,,,,,,,"Building,Co-op Building,Co-operative Movement,Demolition,Todmorden",https://penninehorizons.org/files/original/b404be70be318d3cf7887120f3d20c8d.jpg,"Still Image","Todmorden Antiquarian Society Photographs at the Library",1,0
27130,https://penninehorizons.org/items/show/27130,"Demolition of Todmorden Co-op, Dale Street, Todmorden, 2000 - TAL00169","Building, Co-op Building, Co-operative Movement, Demolition, Todmorden","AN 34131981",,"Todmorden Antiquarian Society","Pennine Horizons Digital Archive",2000,,"PHDA - Todmorden Antiquarian Society","Pennine Horizons Digital Archive","TIFF file 8-bit","English (U.K.)","Documentary photograph",TAL00169.tif,,,,,,,,,,,,,,,,,,,,,,,,,,,,,,,,,,,,"Building,Co-op Building,Co-operative Movement,Demolition,Todmorden",https://penninehorizons.org/files/original/7b5f5a3db1842089dc91cdebc0d445aa.jpg,"Still Image","Todmorden Antiquarian Society Photographs at the Library",1,0
27129,https://penninehorizons.org/items/show/27129,"Demolition of Todmorden Co-op, Dale Street, Todmorden, 2000 - TAL00168","Building, Co-op Building, Co-operative Movement, Demolition, Todmorden","AN 34131981",,"Todmorden Antiquarian Society","Pennine Horizons Digital Archive",2000,,"PHDA - Todmorden Antiquarian Society","Pennine Horizons Digital Archive","TIFF file 8-bit","English (U.K.)","Documentary photograph",TAL00168.tif,,,,,,,,,,,,,,,,,,,,,,,,,,,,,,,,,,,,"Building,Co-op Building,Co-operative Movement,Demolition,Todmorden",https://penninehorizons.org/files/original/8fd0ecb9e6f4554d6a33dcb05932b242.jpg,"Still Image","Todmorden Antiquarian Society Photographs at the Library",1,0
27128,https://penninehorizons.org/items/show/27128,"Demolition of Todmorden Co-op, Dale Street, Todmorden, 2000 - TAL00167","Building, Co-op Building, Co-operative Movement, Demolition, Todmorden","AN 34131981",,"Todmorden Antiquarian Society","Pennine Horizons Digital Archive",2000,,"PHDA - Todmorden Antiquarian Society","Pennine Horizons Digital Archive","TIFF file 8-bit","English (U.K.)","Documentary photograph",TAL00167.tif,,,,,,,,,,,,,,,,,,,,,,,,,,,,,,,,,,,,"Building,Co-op Building,Co-operative Movement,Demolition,Todmorden",https://penninehorizons.org/files/original/5fecd41703b5c5375347f3a546dc90f2.jpg,"Still Image","Todmorden Antiquarian Society Photographs at the Library",1,0
27127,https://penninehorizons.org/items/show/27127,"Demolition of Todmorden Co-op, Dale Street, Todmorden, 2000 - TAL00166","Building, Co-op Building, Co-operative Movement, Demolition, Todmorden","AN 34131981",,"Todmorden Antiquarian Society","Pennine Horizons Digital Archive",2000,,"PHDA - Todmorden Antiquarian Society","Pennine Horizons Digital Archive","TIFF file 8-bit","English (U.K.)","Documentary photograph",TAL00166.tif,,,,,,,,,,,,,,,,,,,,,,,,,,,,,,,,,,,,"Building,Co-op Building,Co-operative Movement,Demolition,Todmorden",https://penninehorizons.org/files/original/2cd1a23339cbe5de8a810f3ae7fbcbf8.jpg,"Still Image","Todmorden Antiquarian Society Photographs at the Library",1,0
27126,https://penninehorizons.org/items/show/27126,"Demolition of Todmorden Co-op, Dale Street, Todmorden, 2000 - TAL00165","Building, Co-op Building, Co-operative Movement, Demolition, Todmorden","AN 34131981",,"Todmorden Antiquarian Society","Pennine Horizons Digital Archive",2000,,"PHDA - Todmorden Antiquarian Society","Pennine Horizons Digital Archive","TIFF file 8-bit","English (U.K.)","Documentary photograph",TAL00165.tif,,,,,,,,,,,,,,,,,,,,,,,,,,,,,,,,,,,,"Building,Co-op Building,Co-operative Movement,Demolition,Todmorden",https://penninehorizons.org/files/original/3c370fec515c2c73a0cfe661b1486a3c.jpg,"Still Image","Todmorden Antiquarian Society Photographs at the Library",1,0
27125,https://penninehorizons.org/items/show/27125,"Demolition of Todmorden Co-op, Dale Street, Todmorden, 2000 - TAL00164","Building, Co-op Building, Co-operative Movement, Demolition, Todmorden","AN 34131981",,"Todmorden Antiquarian Society","Pennine Horizons Digital Archive",2000,,"PHDA - Todmorden Antiquarian Society","Pennine Horizons Digital Archive","TIFF file 8-bit","English (U.K.)","Documentary photograph",TAL00164.tif,,,,,,,,,,,,,,,,,,,,,,,,,,,,,,,,,,,,"Building,Co-op Building,Co-operative Movement,Demolition,Todmorden",https://penninehorizons.org/files/original/5ecfef4b0202acfeef22ecfb2ecc94ab.jpg,"Still Image","Todmorden Antiquarian Society Photographs at the Library",1,0
27124,https://penninehorizons.org/items/show/27124,"Demolition of Todmorden Co-op, Dale Street, Todmorden, 2000 - TAL00163","Building, Co-op Building, Co-operative Movement, Demolition, Todmorden","AN 34131981",,"Todmorden Antiquarian Society","Pennine Horizons Digital Archive",2000,,"PHDA - Todmorden Antiquarian Society","Pennine Horizons Digital Archive","TIFF file 8-bit","English (U.K.)","Documentary photograph",TAL00163.tif,,,,,,,,,,,,,,,,,,,,,,,,,,,,,,,,,,,,"Building,Co-op Building,Co-operative Movement,Demolition,Todmorden",https://penninehorizons.org/files/original/810d9622cc33e1e13378db70616dbe0a.jpg,"Still Image","Todmorden Antiquarian Society Photographs at the Library",1,0
26942,https://penninehorizons.org/items/show/26942,"Lloyds Bank, Sowerby Bridge - CBC06238","Architecture, Building, Chimney, Chimneys, Demolition, Sowerby Bridge",,,"Pennine Horizons Digital Archive","Pennine Horizons Digital Archive",,,"PHDA - Calderdale MBC","Pennine Horizons Digital Archive","TIFF file 8-bit","English (U.K.)","Documentary photograph",CBC06238.tif,,,,,,,,,,,,,,,,,,,,,,,,,,,,,,,,,,,,"Architecture,Building,Chimney,Chimneys,Demolition,Sowerby Bridge",https://penninehorizons.org/files/original/eb529e6517d5252f7ea6cc20d24ffa0d.jpg,"Still Image","CMBC Conservation and Planning collection",1,0
26898,https://penninehorizons.org/items/show/26898,"Top of Winding Road, Halifax, c. early 1980s - CBC06194","Building, Chimney, Chimneys, Demolition, Halifax","This is the view of the top of Winding Road.  The buildings in the immediate foreground are now the site of the bus station.",,"Pennine Horizons Digital Archive","Pennine Horizons Digital Archive",,,"PHDA - Calderdale MBC","Pennine Horizons Digital Archive","TIFF file 8-bit","English (U.K.)","Documentary photograph",CBC06194.tif,,,,,,,,,,,,,,,,,,,,,,,,,,,,,,,,,,,,"Building,Chimney,Chimneys,Demolition,Halifax",https://penninehorizons.org/files/original/bf90488c8ca4df7298f08102fe1c5502.jpg,"Still Image","CMBC Conservation and Planning collection",1,0
23217,https://penninehorizons.org/items/show/23217,"North Side Bridge Lanes, Hebden Bridge - DEF00300","Bridge Lanes, Buildings, Demolition, Dereliction, Hebden Bridge, Street Names","After the demolition of the High Street and Bridge Lanes houses. The site was left derelict for many years.",,"Pennine Horizons Digital Archive","Pennine Horizons Digital Archive","No date yet","David Fletcher","PHDA - David Fletcher Collection","Pennine Horizons Digital Archive","TIFF file 8-bit","English (U.K.)","Documentary photograph",DEF00300.tif,,,,,,,,,,,,,,,,,,,,,,,,,,,,,,,,,,,,"Bridge Lanes,Buildings,Demolition,Dereliction,Hebden Bridge,Street Names",https://penninehorizons.org/files/original/df42270f6b820fc47642018f51f377c1.jpg,"Still Image","David Fletcher collection",1,0
23216,https://penninehorizons.org/items/show/23216,"North Side Bridge Lanes, Hebden Bridge - DEF00299","Bridge Lanes, Buildings, Demolition, Dereliction, Fox & Goose, Hebden Bridge, Heptonstall Road, High Street, Public Houses, Pubs Inns & Hotels, Street Names, Taverns","After the demolition of the High Street and Bridge Lanes houses. The site was left derelict for many years.",,"Pennine Horizons Digital Archive","Pennine Horizons Digital Archive",1960s,"David Fletcher","PHDA - David Fletcher Collection","Pennine Horizons Digital Archive","TIFF file 8-bit","English (U.K.)","Documentary photograph",DEF00299.tif,,,,,,,,,,,,,,,,,,,,,,,,,,,,,,,,,,,,"Bridge Lanes,Buildings,Demolition,Dereliction,Fox & Goose,Hebden Bridge,Heptonstall Road,High Street,Public Houses,Pubs Inns & Hotels,Street Names,Taverns",https://penninehorizons.org/files/original/5e53d475a619e8ef4402492551a5be76.jpg,"Still Image","David Fletcher collection",1,0
22944,https://penninehorizons.org/items/show/22944,"Demolition Jack Bridge Mill, between Heptonstall and Blackshawhead. - DEF00124","Blackshaw Head, Buildings, Colden Clough, Demolition, Heptonstall, Jack Bridge, Mills, Places"," This mill was built as a steam powered mill in 1861 and was the last mill to be built in the Colden Valley.",,"Pennine Horizons Digital Archive","Pennine Horizons Digital Archive",1900s,"David Fletcher","PHDA - David Fletcher Collection","Pennine Horizons Digital Archive","TIFF file 8-bit","English (U.K.)","Documentary photograph",DEF00124.tif,"Hebden Bridge",,,,,,,,,,,,,,,,,,,,,,,,,,,,,,,,,,,"Blackshaw Head,Buildings,Colden Clough,Demolition,Heptonstall,Jack Bridge,Mills,Places",https://penninehorizons.org/files/original/c10277e16dea4d2f5d9086424910bd24.jpg,"Still Image","David Fletcher collection",1,0
22943,https://penninehorizons.org/items/show/22943,"Derelict site. - DEF00123","Buildings, Demolition, Dereliction, Rubbish, rubble","Location not known, but it is the site of a former textile mill.",,"Pennine Horizons Digital Archive","Pennine Horizons Digital Archive","No date yet","David Fletcher","PHDA - David Fletcher Collection","Pennine Horizons Digital Archive","TIFF file 8-bit","English (U.K.)","Documentary photograph",DEF00123.tif,"Hebden Bridge",,,,,,,,,,,,,,,,,,,,,,,,,,,,,,,,,,,"Buildings,Demolition,Dereliction,Rubbish,rubble",https://penninehorizons.org/files/original/4d6082c1c48943c361a14421520f4017.jpg,"Still Image","David Fletcher collection",1,0
18531,https://penninehorizons.org/items/show/18531,"Hebble End, Hebden Bridge - JET00113","Bridge, Buildings, Demolition, Hebble End, Hebden Bridge, Melbourne Mill, Neptune, Places, Street Names","The road to Fairfield. The former Neptune Inn can be seen, also the demolition of Melbourne Mill is in progress.",,"Pennine Horizons Digital Archive","Pennine Horizons Digital Archive","No date yet","Jeanette Thomas","PHDA - Jeanette Thomas Collection","Pennine Horizons Digital Archive","TIFF file 8-bit","English (U.K.)","Documentary photograph",JET00113.tif,,,,,,,,,,,,,,,,,,,,,,,,,,,,,,,,,,,,"Bridge,Buildings,Demolition,Hebble End,Hebden Bridge,Melbourne Mill,Neptune,Places,Street Names",https://penninehorizons.org/files/original/c0b4c6a731450fe9d6326a91539e661a.jpg,"Still Image","Jeanette Thomas collection",1,0
18529,https://penninehorizons.org/items/show/18529,"Demolition of Melbourne Mill, Market Street, Hebden Bridge - JET00111","Buildings, Demolition, Hebden Bridge, Market Street, Melbourne Mill, Places, Street Names",,,"Pennine Horizons Digital Archive","Pennine Horizons Digital Archive","No date yet","Jeanette Thomas","PHDA - Jeanette Thomas Collection","Pennine Horizons Digital Archive","TIFF file 8-bit","English (U.K.)","Documentary photograph",JET00111.tif,,,,,,,,,,,,,,,,,,,,,,,,,,,,,,,,,,,,"Buildings,Demolition,Hebden Bridge,Market Street,Melbourne Mill,Places,Street Names",https://penninehorizons.org/files/original/ec3c956bb1fcd623e149475b3b1c95ed.jpg,"Still Image","Jeanette Thomas collection",1,0
17433,https://penninehorizons.org/items/show/17433,"Looking from Heptonstall road to Bridge Lanes - ALC05858","Bridge, Bridge Lanes, Buildings, Demolition, Hebden Bridge, High Street, Street Names","In the 1960s the houses between Bridge Lanes and Heptonstall road were demolished.",,"Pennine Horizons Digital Archive","Pennine Horizons Digital Archive","No date yet",,"PHDA - Alice Longstaff Collection","Pennine Horizons Digital Archive","TIFF file 8-bit","English (U.K.)","Documentary photograph",ALC05858.tif,,,,,,,,,,,,,,,,,,,,,,,,,,,,,,,,,,,,"Bridge,Bridge Lanes,Buildings,Demolition,Hebden Bridge,High Street,Street Names",https://penninehorizons.org/files/original/fa8493dc24a3a844cd27a240f28b3ddd.jpg,"Still Image","Alice Longstaff - General Pictures",1,0
