﻿"Item Id","Item URI","Dublin Core:Title","Dublin Core:Subject","Dublin Core:Description","Dublin Core:Creator","Dublin Core:Source","Dublin Core:Publisher","Dublin Core:Date","Dublin Core:Contributor","Dublin Core:Rights","Dublin Core:Relation","Dublin Core:Format","Dublin Core:Language","Dublin Core:Type","Dublin Core:Identifier","Dublin Core:Coverage","Item Type Metadata:Lesson Plan Text","Item Type Metadata:Bibliography","Item Type Metadata:Biographical Text","Item Type Metadata:Occupation","Item Type Metadata:Death Date","Item Type Metadata:Birthplace","Item Type Metadata:Birth Date","Item Type Metadata:Participants","Item Type Metadata:Event Type","Item Type Metadata:URL","Item Type Metadata:Bit Rate/Frequency","Item Type Metadata:Interviewer","Item Type Metadata:Interviewee","Item Type Metadata:Location","Item Type Metadata:Transcription","Item Type Metadata:Local URL","Item Type Metadata:Original Format","Item Type Metadata:Physical Dimensions","Item Type Metadata:Duration","Item Type Metadata:Compression","Item Type Metadata:Producer","Item Type Metadata:Director","Item Type Metadata:Text","Item Type Metadata:Time Summary","Item Type Metadata:Email Body","Item Type Metadata:Subject Line","Item Type Metadata:From","Item Type Metadata:To","Item Type Metadata:CC","Item Type Metadata:BCC","Item Type Metadata:Number of Attachments","Item Type Metadata:Standards","Item Type Metadata:Objectives","Item Type Metadata:Materials",tags,file,itemType,collection,public,featured
4875,https://penninehorizons.org/items/show/4875,"Mid Slack, Heptonstall - DMC05056","Aerial View, Buildings, Construction, Hebden Bridge","John Westall preparing a couple of tups for showing, in the corner of his Mid Slack pasture by the red van. 1980s.",Aerofilms,"Pennine Horizons Digital Archive","Pennine Horizons Digital Archive",1980s,"David Martin","PHDA - David Martin Collection","Pennine Horizons Digital Archive","TIFF file 8-bit","English (U.K.)","Documentary photograph",DMC05056.tif,"Heptonstall, 53°45'15"" N 2°1'57"" W ",,,,,,,,,,,,,,,,,,,,,,,,,,,,,,,,,,,"Aerial View,Buildings,Construction,Hebden Bridge",https://penninehorizons.org/files/original/a61047276b21b77702dca99b50a4df61.jpg,"Still Image","David Martin Aerial collection",1,0
8917,https://penninehorizons.org/items/show/8917,"Mersey Tunnel Construction - KES00147","Buildings, Construction, Liverpool, People, People at Work, Railway, Railways, Tunnel","The tunnel was opened 18th July 1934, and this photo was taken the day before that.
",Unknown,"Pennine Horizons Digital Archive","Pennine Horizons Digital Archive",1930s,"Keith Stansfield","PHDA - Keith Stansfield Collection","Pennine Horizons Digital Archive","TIFF file 8-bit","English (U.K.)","Documentary photograph",KES00147.tif,,,,,,,,,,,,,,,,,,,,,,,,,,,,,,,,,,,,"Buildings,Construction,Liverpool,People,People at Work,Railway,Railways,Tunnel",https://penninehorizons.org/files/original/74f72f75065e2b51e10b2439da82756d.jpg,"Still Image","Keith Stansfield collection",1,0
20471,https://penninehorizons.org/items/show/20471,"Machpelah May, Hebden Bridge, 1911 - RAW00124","Buildings, Cobbles, Construction, Hebden Bridge, Machpelah, Tram Lines","Road improvements, view before widening. Note the cobbled road with tram lines and power lines above.  The Halifax Corporation trams reached Hebden Bridge in 191/2 and ceased in 1936.","Ronda Ashworth","Pennine Horizons Digital Archive","Pennine Horizons Digital Archive",1910s,"Ronda Ashworth","PHDA - Ronda Ashworth Collection","Pennine Horizons Digital Archive","TIFF file 8-bit","English (U.K.)","Documentary photograph",RAW00124.TIF,,,,,,,,,,,,,,,,,,,,,,,,,,,,,,,,,,,,"1910s,Buildings,Cobbles,Construction,Hebden Bridge,Machpelah,Tram Lines",https://penninehorizons.org/files/original/c9986c4faf8f73e5a5871d35e61cbf8d.jpg,"Still Image","Ronda Ashworth collection",1,0
24647,https://penninehorizons.org/items/show/24647,"M62 - TWA00260","Buildings, Construction, Crane, Cranes, M62, Street Names, Tom Walker","The start of the construction of the M62","Tom Walker","Olwen Forest","Pennine Horizons Digital Archive","1960 , 1960s","Olwen Forest","PHDA - Tom Walker Collection","Pennine Horizons Digital Archive","TIFF file 8-bit","English (U.K.)","Documentary photograph",TWA00260.tif,,,,,,,,,,,,,,,,,,,,,,,,,,,,,,,,,,,,"Buildings,Construction,Crane,Cranes,M62,Street Names,Tom Walker",https://penninehorizons.org/files/original/01d7229e3c2095369811cb7d7a8b3c84.jpg,"Still Image","Tom Walker collection",1,0
36551,https://penninehorizons.org/items/show/36551,"Lumbutts, Todmorden - CRN00417","Construction, Croft farm, Lumbutts, Todmorden","Renovations at Croft Farm 2002",,,"Pennine Horizons Digital Archive",2016-10-26T10:28:54,,"PHDA - Christine Newell collection","Pennine Horizons Digital Archive","TIFF file 8-bit","English (U.K.)","Documentary photograph",CRN00417.jpg,,,,,,,,,,,,,,,,,,,,,,,,,,,,,,,,,,,,"Construction,Croft farm,Lumbutts,Todmorden",https://penninehorizons.org/files/original/653b0ef08532c53d337aacac07c6a799.jpg,"Still Image","Christine Newell collection",1,0
34260,https://penninehorizons.org/items/show/34260,"Looking down on Mytholm - BIM00836","Building, Construction, Hebden Bridge, Heptonstall Church, Mytholm, St James","The sheltered housing complex of Mytholm Meadows is being built",,,"Pennine Horizons Digital Archive",,,"PHDA - Bill Marsden Collection","Pennine Horizons Digital Archive","TIFF file 8-bit","English (U.K.)","Documentary photograph",BIM00836.tif,,,,,,,,,,,,,,,,,,,,,,,,,,,,,,,,,,,,"Building,Construction,Hebden Bridge,Heptonstall Church,Mytholm,St James",https://penninehorizons.org/files/original/e6d38d6e05421a2dc5aef03bf12b5547.jpg,"Still Image","Bill Marsden collection",1,0
27432,https://penninehorizons.org/items/show/27432,"Laying the Cornerstone - TAL00502","Building, Construction, Cornerstone, Crowd, Crowds, Event, Library, People, Todmorden","Laying of Todmorden Free Library Cornerstone, 1896. AN 69927699",,"Todmorden Antiquarian Society","Pennine Horizons Digital Archive",1896,,"PHDA - Todmorden Antiquarian Society","Pennine Horizons Digital Archive","TIFF file 8-bit","English (U.K.)","Documentary photograph",TAL00502.tif,,,,,,,,,,,,,,,,,,,,,,,,,,,,,,,,,,,,"Building,Construction,Cornerstone,Crowd,Crowds,Event,Library,People,Todmorden",https://penninehorizons.org/files/original/8079133b20c582445beb95e731b78563.jpg,"Still Image","Todmorden Antiquarian Society Photographs at the Library",1,0
10537,https://penninehorizons.org/items/show/10537,"Industrial Units Being Built - MOT00422","Buildings, Church, Churches & Chapels, Churches_&_Chapels, Construction, Minster, People, People at Work, Steam Power, Unitarian Church","Calderdale's small industrial units were built on the site of Salford Mill in 1980.",,"Todmorden Information Centre Trust","Pennine Horizons Digital Archive","No date yet","Roger Birch","PHDA - Todmorden Information Centre Trust","Pennine Horizons Digital Archive","TIFF file 8-bit","English (U.K.)","Documentary photograph",MOT00422.tif,Todmorden,,,,,,,,,,,,,,,,,,,,,,,,,,,,,,,,,,,"Buildings,Church,Churches and Chapels,Construction,Minster,People,People at Work,Steam Power,Unitarian Church",https://penninehorizons.org/files/original/7e729dab2583ae5e39a6dd2fbb672276.jpg,"Still Image","The Making of Todmorden exhibition",1,0
5529,https://penninehorizons.org/items/show/5529,"Hollins Place, Hebden Bridge, c1957 - HBC00584 ","Buildings, Commercial Street, Construction, Hebden Bridge, Places, Street Names","Road improvement works. The setts in the foreground are part of Keighley Road, On the right is the rear of the White Horse Hotel.",Unknown,"Hebden Bridge Camera Club","Pennine Horizons Digital Archive",1950s,"Hebden Bridge Camera Club","PHDA - Hebden Bridge Camera Club","Pennine Horizons Digital Archive","TIFF file 8-bit","English (U.K.)","Documentary photograph",HBC00584.tif,,,,,,,,,,,,,,,,,,,,,,,,,,,,,,,,,,,,"1950s,Buildings,Commercial Street,Construction,Hebden Bridge,Street Names",https://penninehorizons.org/files/original/8819ca51b18a5e9ae62983bad8136db5.jpg,"Still Image","Hebden Bridge Camera Club - The Changing Face of Hebden Bridge",1,0
13488,https://penninehorizons.org/items/show/13488,"Hollin Hall pumping station opening event - ALC00778","Buildings, Construction, Hall, Hollin Hall, Reservoir, pumping station","Stiuated in the Crimsworth Valley it ceased operating in 1990.",,"Pennine Horizons Digital Archive","Pennine Horizons Digital Archive","No date yet",,"PHDA - Alice Longstaff Collection","Pennine Horizons Digital Archive","TIFF file 8-bit","English (U.K.)","Documentary photograph",ALC00778.tif,,,,,,,,,,,,,,,,,,,,,,,,,,,,,,,,,,,,"Buildings,Construction,Hall,Hollin Hall,pumping station,Reservoir",https://penninehorizons.org/files/original/38b874a8f1e578e49d4ac7f22de69c6d.jpg,"Still Image","Alice Longstaff - General Pictures",1,0
29540,https://penninehorizons.org/items/show/29540,"Hebden Bridge Town Hall - MOS00166","Building, Construction, Council Offices, Crane, Cranes, Hebden Bridge, People, People at Work, Stubbings School, Town Hall","November 2011 and work is in progress on the extension to Hebden Bridge Town Hall.","Max Sunderland",,,2011-10-20T11:56:49.094,,"PHDA - Molly Sunderland Collection","Pennine Horizons Digital Archive",,"English (U.K.)","Documentary photograph",MOS00166.tif,,,,,,,,,,,,,,,,,,,,,,,,,,,,,,,,,,,,"Building,Construction,Council Offices,Crane,Cranes,Hebden Bridge,People,People at Work,Stubbings School,Town Hall",https://penninehorizons.org/files/original/40dab871d93d683bf0468004224bef7f.jpg,"Still Image","Molly Sunderland Collection",1,0
16689,https://penninehorizons.org/items/show/16689,"Hebden Bridge Gas Works 1912 - ALC05109","Buildings, Construction, Gas Works, Hebden Bridge","Hebden Bridge gas works under construction on 30th (not 31st as printed on the original photo) September 1912. The gas works were a municipal undertaking and remained so until nationalisation of the gas industry in 1949.",,"Pennine Horizons Digital Archive","Pennine Horizons Digital Archive",1910s,,"PHDA - Alice Longstaff Collection","Pennine Horizons Digital Archive","TIFF file 8-bit","English (U.K.)","Documentary photograph",ALC05109.tif,,,,,,,,,,,,,,,,,,,,,,,,,,,,,,,,,,,,"1910s,Buildings,Construction,Gas Works,Hebden Bridge",https://penninehorizons.org/files/original/ccd71f32890ad26705d60eb009486aff.jpg,"Still Image","Alice Longstaff - General Pictures",1,0
16688,https://penninehorizons.org/items/show/16688,"Hebden Bridge Gas Works 1912 - ALC05108","Buildings, Construction, Gas Works, Hebden Bridge","Hebden Bridge Gas Works under construction on 30th September 1912. The gas works were a municipal undertaking and remained so until nationalisation of the gas industry in 1949.",,"Pennine Horizons Digital Archive","Pennine Horizons Digital Archive",1910s,,"PHDA - Alice Longstaff Collection","Pennine Horizons Digital Archive","TIFF file 8-bit","English (U.K.)","Documentary photograph",ALC05108.tif,,,,,,,,,,,,,,,,,,,,,,,,,,,,,,,,,,,,"1910s,Buildings,Construction,Gas Works,Hebden Bridge",https://penninehorizons.org/files/original/230f32ef3cb44703ae550cf844231724.jpg,"Still Image","Alice Longstaff - General Pictures",1,0
16687,https://penninehorizons.org/items/show/16687,"Hebden Bridge Gas Works 1912 - ALC05107","Buildings, Construction, Gas Works, Hebden Bridge","Hebden Bridge Gas Works under construction on 27th August 1912. The gas works were a municipal undertaking and remained so until nationalisation of the gas industry in 1949.",,"Pennine Horizons Digital Archive","Pennine Horizons Digital Archive",1910s,,"PHDA - Alice Longstaff Collection","Pennine Horizons Digital Archive","TIFF file 8-bit","English (U.K.)","Documentary photograph",ALC05107.tif,,,,,,,,,,,,,,,,,,,,,,,,,,,,,,,,,,,,"1910s,Buildings,Construction,Gas Works,Hebden Bridge",https://penninehorizons.org/files/original/668827a68a15347d7a963cd4ae9f84d5.jpg,"Still Image","Alice Longstaff - General Pictures",1,0
16686,https://penninehorizons.org/items/show/16686,"Hebden Bridge Gas Works 1912 - ALC05106","Buildings, Construction, Gas Works, Hebden Bridge","Hebden Bridge Gas Works under construction on 26th July 1912. The gas works were a municipal undertaking and remained so until nationalisation of the gas industry in 1949.",,"Pennine Horizons Digital Archive","Pennine Horizons Digital Archive",1910s,,"PHDA - Alice Longstaff Collection","Pennine Horizons Digital Archive","TIFF file 8-bit","English (U.K.)","Documentary photograph",ALC05106.tif,,,,,,,,,,,,,,,,,,,,,,,,,,,,,,,,,,,,"1910s,Buildings,Construction,Gas Works,Hebden Bridge",https://penninehorizons.org/files/original/50bef57bae9fbf8b137928afc0c1e8bc.jpg,"Still Image","Alice Longstaff - General Pictures",1,0
16685,https://penninehorizons.org/items/show/16685,"Hebden Bridge Gas Works 1912 - ALC05105","Buildings, Construction, Gas Works, Hebden Bridge","Hebden Bridge gas works under construction on 21st October 1912. The gas works were a municipal undertaking and remained so until nationalisation of the gas industry in 1949.",,"Pennine Horizons Digital Archive","Pennine Horizons Digital Archive",1910s,,"PHDA - Alice Longstaff Collection","Pennine Horizons Digital Archive","TIFF file 8-bit","English (U.K.)","Documentary photograph",ALC05105.tif,,,,,,,,,,,,,,,,,,,,,,,,,,,,,,,,,,,,"1910s,Buildings,Construction,Gas Works,Hebden Bridge",https://penninehorizons.org/files/original/1ba31b57a7548613ec9b84614ee860b7.jpg,"Still Image","Alice Longstaff - General Pictures",1,0
16684,https://penninehorizons.org/items/show/16684,"Hebden Bridge Gas Works 1912 - ALC05104","Buildings, Construction, Gas Works, Hebden Bridge","Hebden Bridge gas works under construction on 19th November 1912. The gas works were a municipal undertaking and remained so until nationalisation of the gas industry in 1949.",,"Pennine Horizons Digital Archive","Pennine Horizons Digital Archive",1910s,,"PHDA - Alice Longstaff Collection","Pennine Horizons Digital Archive","TIFF file 8-bit","English (U.K.)","Documentary photograph",ALC05104.tif,,,,,,,,,,,,,,,,,,,,,,,,,,,,,,,,,,,,"1910s,Buildings,Construction,Gas Works,Hebden Bridge",https://penninehorizons.org/files/original/6b688452dfb65d27f3469a435051313e.jpg,"Still Image","Alice Longstaff - General Pictures",1,0
16683,https://penninehorizons.org/items/show/16683,"Hebden Bridge Gas Works 1912 - ALC05103","Buildings, Construction, Gas Works, Hebden Bridge","Hebden Bridge Gas Works under construction on 17th July 1912. The gas works were a municipal undertaking and remained so until nationalisation of the gas industry in 1949.",,"Pennine Horizons Digital Archive","Pennine Horizons Digital Archive",1910s,,"PHDA - Alice Longstaff Collection","Pennine Horizons Digital Archive","TIFF file 8-bit","English (U.K.)","Documentary photograph",ALC05103.tif,,,,,,,,,,,,,,,,,,,,,,,,,,,,,,,,,,,,"1910s,Buildings,Construction,Gas Works,Hebden Bridge",https://penninehorizons.org/files/original/755c22307746fb446d3b83cbe0b37427.jpg,"Still Image","Alice Longstaff - General Pictures",1,0
16681,https://penninehorizons.org/items/show/16681,"Hebden Bridge Gas Works 1912 - ALC05101","Buildings, Construction, Gas Works, Hebden Bridge","Hebden Bridge Gas Works under construction on 7th September 1912. The gas works were a municipal undertaking and remained so until nationalisation of the gas industry in 1949.",,"Pennine Horizons Digital Archive","Pennine Horizons Digital Archive",1910s,,"PHDA - Alice Longstaff Collection","Pennine Horizons Digital Archive","TIFF file 8-bit","English (U.K.)","Documentary photograph",ALC05101.tif,,,,,,,,,,,,,,,,,,,,,,,,,,,,,,,,,,,,"1910s,Buildings,Construction,Gas Works,Hebden Bridge",https://penninehorizons.org/files/original/1b7d21400a5e57828e8620e175134cef.jpg,"Still Image","Alice Longstaff - General Pictures",1,0
16680,https://penninehorizons.org/items/show/16680,"Hebden Bridge Gas Works 1912 - ALC05100","Buildings, Construction, Gas Works, Hebden Bridge","Hebden Bridge gas works under construction on 7th November 1912. The gas works were a municipal undertaking and remained so until nationalisation of the gas industry in 1949.",,"Pennine Horizons Digital Archive","Pennine Horizons Digital Archive",1910s,,"PHDA - Alice Longstaff Collection","Pennine Horizons Digital Archive","TIFF file 8-bit","English (U.K.)","Documentary photograph",ALC05100.tif,,,,,,,,,,,,,,,,,,,,,,,,,,,,,,,,,,,,"1910s,Buildings,Construction,Gas Works,Hebden Bridge",https://penninehorizons.org/files/original/0db2d188e8abe751ec8a0fd2c6c0d236.jpg,"Still Image","Alice Longstaff - General Pictures",1,0
16678,https://penninehorizons.org/items/show/16678,"Hebden Bridge Gas Works 1912 - ALC05098","Buildings, Construction, Gas Works, Hebden Bridge","Hebden Bridge gas works under construction on 3rd August 1912. The gas works were a municipal undertaking and remained so until nationalisation of the gas industry in 1949.",,"Pennine Horizons Digital Archive","Pennine Horizons Digital Archive",1910s,,"PHDA - Alice Longstaff Collection","Pennine Horizons Digital Archive","TIFF file 8-bit","English (U.K.)","Documentary photograph",ALC05098.tif,,,,,,,,,,,,,,,,,,,,,,,,,,,,,,,,,,,,"1910s,Buildings,Construction,Gas Works,Hebden Bridge",https://penninehorizons.org/files/original/631670b924f02fda3d7a2d9fffb7719d.jpg,"Still Image","Alice Longstaff - General Pictures",1,0
16677,https://penninehorizons.org/items/show/16677,"Hebden Bridge Gas Works 1912 - ALC05097","Buildings, Construction, Gas Works, Hebden Bridge","Hebden Bridge gas works under construction on 2nd November 1912. The gas works were a municipal undertaking and remained so until nationalisation of the gas industry in 1949.",,"Pennine Horizons Digital Archive","Pennine Horizons Digital Archive",1910s,,"PHDA - Alice Longstaff Collection","Pennine Horizons Digital Archive","TIFF file 8-bit","English (U.K.)","Documentary photograph",ALC05097.tif,,,,,,,,,,,,,,,,,,,,,,,,,,,,,,,,,,,,"1910s,Buildings,Construction,Gas Works,Hebden Bridge",https://penninehorizons.org/files/original/3c29f9639cd4337d7b0f772ca0dfd243.jpg,"Still Image","Alice Longstaff - General Pictures",1,0
16682,https://penninehorizons.org/items/show/16682,"Hebden Bridge Gas Works - ALC05102","Buildings, Construction, Gas Works, Hebden Bridge","Under construction on 16th September 1912. The gas works were a municipal undertaking and remained so until nationalisation of the gas industry in 1949.",,"Pennine Horizons Digital Archive","Pennine Horizons Digital Archive",1910s,,"PHDA - Alice Longstaff Collection","Pennine Horizons Digital Archive","TIFF file 8-bit","English (U.K.)","Documentary photograph",ALC05102.TIF,,,,,,,,,,,,,,,,,,,,,,,,,,,,,,,,,,,,"1910s,Buildings,Construction,Gas Works,Hebden Bridge",https://penninehorizons.org/files/original/01b23087bd22e3582ce8ea385a8eda8a.jpg,"Still Image","Alice Longstaff - General Pictures",1,0
16679,https://penninehorizons.org/items/show/16679,"Hebden Bridge Gas Works - ALC05099","Buildings, Construction, Gas Works, Hebden Bridge","Under construction on 6th November 1912. The gas works were a municipal undertaking and remained so until nationalisation of the gas industry in 1949.",,"Pennine Horizons Digital Archive","Pennine Horizons Digital Archive",1910s,,"PHDA - Alice Longstaff Collection","Pennine Horizons Digital Archive","TIFF file 8-bit","English (U.K.)","Documentary photograph",ALC05099.TIF,,,,,,,,,,,,,,,,,,,,,,,,,,,,,,,,,,,,"1910s,Buildings,Construction,Gas Works,Hebden Bridge",https://penninehorizons.org/files/original/71de1e2d292968d4261c5169071bd594.jpg,"Still Image","Alice Longstaff - General Pictures",1,0
5953,https://penninehorizons.org/items/show/5953,"Hebble End, Hebden Bridge, 1983 - HBC01013 ","Buildings, Canal, Canals, Construction, Hebden Bridge, Places, Transport","Widening the canal bridge as part of the restoration of the Rochdale Canal.","K. Green","Hebden Bridge Camera Club","Pennine Horizons Digital Archive","No date yet","Hebden Bridge Camera Club","PHDA - Hebden Bridge Camera Club","Pennine Horizons Digital Archive","TIFF file 8-bit","English (U.K.)","Documentary photograph",HBC01013.tif,,,,,,,,,,,,,,,,,,,,,,,,,,,,,,,,,,,,"Buildings,Canal,Construction,Hebden Bridge,Transport",https://penninehorizons.org/files/original/a2c0fe0c5e4f50fab4cabe897aaf71fd.jpg,"Still Image","Hebden Bridge Camera Club - The Changing Face of Hebden Bridge",1,0
