﻿"Item Id","Item URI","Dublin Core:Title","Dublin Core:Subject","Dublin Core:Description","Dublin Core:Creator","Dublin Core:Source","Dublin Core:Publisher","Dublin Core:Date","Dublin Core:Contributor","Dublin Core:Rights","Dublin Core:Relation","Dublin Core:Format","Dublin Core:Language","Dublin Core:Type","Dublin Core:Identifier","Dublin Core:Coverage","Item Type Metadata:Lesson Plan Text","Item Type Metadata:Bibliography","Item Type Metadata:Biographical Text","Item Type Metadata:Occupation","Item Type Metadata:Death Date","Item Type Metadata:Birthplace","Item Type Metadata:Birth Date","Item Type Metadata:Participants","Item Type Metadata:Event Type","Item Type Metadata:URL","Item Type Metadata:Bit Rate/Frequency","Item Type Metadata:Interviewer","Item Type Metadata:Interviewee","Item Type Metadata:Location","Item Type Metadata:Transcription","Item Type Metadata:Local URL","Item Type Metadata:Original Format","Item Type Metadata:Physical Dimensions","Item Type Metadata:Duration","Item Type Metadata:Compression","Item Type Metadata:Producer","Item Type Metadata:Director","Item Type Metadata:Text","Item Type Metadata:Time Summary","Item Type Metadata:Email Body","Item Type Metadata:Subject Line","Item Type Metadata:From","Item Type Metadata:To","Item Type Metadata:CC","Item Type Metadata:BCC","Item Type Metadata:Number of Attachments","Item Type Metadata:Standards","Item Type Metadata:Objectives","Item Type Metadata:Materials",tags,file,itemType,collection,public,featured
5589,https://penninehorizons.org/items/show/5589,"Moss Lane - date unknown - HBC00643 ","Gas Lamp, Hebden Bridge, Housing, Moss Lane, Street Names","Moss Lane before adoption. Note the gas lamp.",Unknown,"Hebden Bridge Camera Club","Pennine Horizons Digital Archive","No date yet","Hebden Bridge Camera Club","PHDA - Hebden Bridge Camera Club","Pennine Horizons Digital Archive","TIFF file 8-bit","English (U.K.)","Documentary photograph",HBC00643.tif,,,,,,,,,,,,,,,,,,,,,,,,,,,,,,,,,,,,"Gas Lamp,Hebden Bridge,Housing,Moss Lane,Street Names",https://penninehorizons.org/files/original/57ba01dea19760b8a7537907089bb1ac.jpg,"Still Image","Hebden Bridge Camera Club - The Changing Face of Hebden Bridge",1,0
5579,https://penninehorizons.org/items/show/5579,"Foster Lane Cottages 1962 - HBC00633 ","Bridge, Foster Lane, Gas Lamp, Hebden Bridge, Housing, Street Names",,"W. Brown","Hebden Bridge Camera Club","Pennine Horizons Digital Archive",1960s,"Hebden Bridge Camera Club","PHDA - Hebden Bridge Camera Club","Pennine Horizons Digital Archive","TIFF file 8-bit","English (U.K.)","Documentary photograph",HBC00633.tif,,,,,,,,,,,,,,,,,,,,,,,,,,,,,,,,,,,,"1960s,Bridge,Foster Lane,Gas Lamp,Hebden Bridge,Housing,Street Names",https://penninehorizons.org/files/original/8eea59c637a18cd29ece63251fb5d189.jpg,"Still Image","Hebden Bridge Camera Club - The Changing Face of Hebden Bridge",1,0
5576,https://penninehorizons.org/items/show/5576,"Birchcliffe Road - HBC00630 ","Birchcliffe Road, Buildings, Construction, Gas Lamp, Hebden Bridge, Street Names","Birchcliffe Road improvements","Halifax Courier","Hebden Bridge Camera Club","Pennine Horizons Digital Archive","No date yet","Hebden Bridge Camera Club","PHDA - Hebden Bridge Camera Club","Pennine Horizons Digital Archive","TIFF file 8-bit","English (U.K.)","Documentary photograph",HBC00630.tif,,,,,,,,,,,,,,,,,,,,,,,,,,,,,,,,,,,,"Birchcliffe Road,Buildings,Construction,Gas Lamp,Hebden Bridge,Street Names",https://penninehorizons.org/files/original/b7b988859dd5b92fb14b4881ecfb698e.jpg,"Still Image","Hebden Bridge Camera Club - The Changing Face of Hebden Bridge",1,0
5575,https://penninehorizons.org/items/show/5575,"Birchcliffe Road - HBC00629 ","Birchcliffe Road, Cobbles, Gas Lamp, Hebden Bridge, Street Names","Birchcliffe Road near the Birchcliffe Chapel, out of the picture on the left.","Halifax Courier","Hebden Bridge Camera Club","Pennine Horizons Digital Archive","No date yet","Hebden Bridge Camera Club","PHDA - Hebden Bridge Camera Club","Pennine Horizons Digital Archive","TIFF file 8-bit","English (U.K.)","Documentary photograph",HBC00629.tif,,,,,,,,,,,,,,,,,,,,,,,,,,,,,,,,,,,,"Birchcliffe Road,Cobbles,Gas Lamp,Hebden Bridge,Street Names",https://penninehorizons.org/files/original/34f8840a0401e3ed3b422ce014f3f2e7.jpg,"Still Image","Hebden Bridge Camera Club - The Changing Face of Hebden Bridge",1,0
5574,https://penninehorizons.org/items/show/5574,"Commercial Street - HBC00628 ","Commercial Street, Gas Lamp, Hebden Bridge, Street Names",,"W. Brown","Hebden Bridge Camera Club","Pennine Horizons Digital Archive","No date yet","Hebden Bridge Camera Club","PHDA - Hebden Bridge Camera Club","Pennine Horizons Digital Archive","TIFF file 8-bit","English (U.K.)","Documentary photograph",HBC00628.tif,,,,,,,,,,,,,,,,,,,,,,,,,,,,,,,,,,,,"Commercial Street,Gas Lamp,Hebden Bridge,Street Names",https://penninehorizons.org/files/original/c8ab415bd50c3384a51558c3fb851868.jpg,"Still Image","Hebden Bridge Camera Club - The Changing Face of Hebden Bridge",1,0
5573,https://penninehorizons.org/items/show/5573,"Commercial Street - HBC00627 ","Commercial Street, Gas Lamp, Hebden Bridge, Street Names",,"W. Brown","Hebden Bridge Camera Club","Pennine Horizons Digital Archive","No date yet","Hebden Bridge Camera Club","PHDA - Hebden Bridge Camera Club","Pennine Horizons Digital Archive","TIFF file 8-bit","English (U.K.)","Documentary photograph",HBC00627.tif,,,,,,,,,,,,,,,,,,,,,,,,,,,,,,,,,,,,"Commercial Street,Gas Lamp,Hebden Bridge,Street Names",https://penninehorizons.org/files/original/a90b76e812f9154fc27dd974cb50ed1e.jpg,"Still Image","Hebden Bridge Camera Club - The Changing Face of Hebden Bridge",1,0
5572,https://penninehorizons.org/items/show/5572,"Commercial Street - HBC00626 ","Commercial Street, Gas Lamp, Hebden Bridge, Street Names",,"W. Brown","Hebden Bridge Camera Club","Pennine Horizons Digital Archive","No date yet","Hebden Bridge Camera Club","PHDA - Hebden Bridge Camera Club","Pennine Horizons Digital Archive","TIFF file 8-bit","English (U.K.)","Documentary photograph",HBC00626.tif,,,,,,,,,,,,,,,,,,,,,,,,,,,,,,,,,,,,"Commercial Street,Gas Lamp,Hebden Bridge,Street Names",https://penninehorizons.org/files/original/eaff1a80850e8d35cd5a08b890076724.jpg,"Still Image","Hebden Bridge Camera Club - The Changing Face of Hebden Bridge",1,0
5562,https://penninehorizons.org/items/show/5562,"Cottages on Spring Grove - HBC00616 ","Gas Lamp, Hangingroyd Lane, Hebden Bridge, Spring Grove, Street Names",,"E. Carr","Hebden Bridge Camera Club","Pennine Horizons Digital Archive","No date yet","Hebden Bridge Camera Club","PHDA - Hebden Bridge Camera Club","Pennine Horizons Digital Archive","TIFF file 8-bit","English (U.K.)","Documentary photograph",HBC00616.tif,,,,,,,,,,,,,,,,,,,,,,,,,,,,,,,,,,,,"Gas Lamp,Hangingroyd Lane,Hebden Bridge,Spring Grove,Street Names",https://penninehorizons.org/files/original/461c045c4b16eae16f7aeae4f8a50152.jpg,"Still Image","Hebden Bridge Camera Club - The Changing Face of Hebden Bridge",1,0
5547,https://penninehorizons.org/items/show/5547,"Buttress Brink, Hebden Bridge, August 1961 - HBC00601 ","Buildings, Buttress Brink, Flag stones, Gas Lamp, Hebden Bridge, Places, Washing Line","A general view from the top.","W. Brown","Hebden Bridge Camera Club","Pennine Horizons Digital Archive",1960s,"Hebden Bridge Camera Club","PHDA - Hebden Bridge Camera Club","Pennine Horizons Digital Archive","TIFF file 8-bit","English (U.K.)","Documentary photograph",HBC00601.tif,,,,,,,,,,,,,,,,,,,,,,,,,,,,,,,,,,,,"1960s,Buildings,Buttress Brink,Flag stones,Gas Lamp,Hebden Bridge,Washing Line",https://penninehorizons.org/files/original/758b6aff4c9ed785772659b7175070bd.jpg,"Still Image","Hebden Bridge Camera Club - The Changing Face of Hebden Bridge",1,0
5517,https://penninehorizons.org/items/show/5517,"High Street, Hebden Bridge, 1962 - HBC00572 ","Derelict, Gas Lamp, Hebden Bridge, Houses, Places","The houses are shown here shortly before demolition.","W. Brown","Hebden Bridge Camera Club","Pennine Horizons Digital Archive",1960s,"Hebden Bridge Camera Club","PHDA - Hebden Bridge Camera Club","Pennine Horizons Digital Archive","TIFF file 8-bit","English (U.K.)","Documentary photograph",HBC00572.tif,,,,,,,,,,,,,,,,,,,,,,,,,,,,,,,,,,,,"1960s,Derelict,Gas Lamp,Hebden Bridge,Houses",https://penninehorizons.org/files/original/a063bf6fe7568e358d1cb651fee1eb72.jpg,"Still Image","Hebden Bridge Camera Club - The Changing Face of Hebden Bridge",1,0
5516,https://penninehorizons.org/items/show/5516,"High Street, Hebden Bridge, 1962 - HBC00571 ","Cobbles, Gas Lamp, Hebden Bridge, Houses, Places",,"W. Brown","Hebden Bridge Camera Club","Pennine Horizons Digital Archive",1960s,"Hebden Bridge Camera Club","PHDA - Hebden Bridge Camera Club","Pennine Horizons Digital Archive","TIFF file 8-bit","English (U.K.)","Documentary photograph",HBC00571.tif,,,,,,,,,,,,,,,,,,,,,,,,,,,,,,,,,,,,"1960s,Cobbles,Gas Lamp,Hebden Bridge,Houses",https://penninehorizons.org/files/original/88a2e3f9c53d195b0c38cbb8fb172813.jpg,"Still Image","Hebden Bridge Camera Club - The Changing Face of Hebden Bridge",1,0
5508,https://penninehorizons.org/items/show/5508,"Old Gate, Hebden Bridge - HBC00563 ","Bridge, Buildings, Cafe, Gas Lamp, Hebden Bridge, Old Gate, Places, River, Street Names, West End","The rear of Nickies Cafe, which was pulled down in the 1960s as part of the West End Improvement Area.","C.L. Shaw","Hebden Bridge Camera Club","Pennine Horizons Digital Archive","No date yet","Hebden Bridge Camera Club","PHDA - Hebden Bridge Camera Club","Pennine Horizons Digital Archive","TIFF file 8-bit","English (U.K.)","Documentary photograph",HBC00563.tif,,,,,,,,,,,,,,,,,,,,,,,,,,,,,,,,,,,,"Bridge,Buildings,Cafe,Gas Lamp,Hebden Bridge,Old Gate,River,Street Names,West End",https://penninehorizons.org/files/original/b79a5c8c3b73826837ee75e0efc622c1.jpg,"Still Image","Hebden Bridge Camera Club - The Changing Face of Hebden Bridge",1,0
5475,https://penninehorizons.org/items/show/5475,"Croft Place, Bridge Lanes, Hebden Bridge - HBC00530 ","Gas Lamp, Hebden Bridge, Housing",,"W. Brown","Hebden Bridge Camera Club","Pennine Horizons Digital Archive","No date yet","Hebden Bridge Camera Club","PHDA - Hebden Bridge Camera Club","Pennine Horizons Digital Archive","TIFF file 8-bit","English (U.K.)","Documentary photograph",HBC00530.tif,,,,,,,,,,,,,,,,,,,,,,,,,,,,,,,,,,,,"Gas Lamp,Hebden Bridge,Housing",https://penninehorizons.org/files/original/a7e628b35d1bb6fa4da91d735c5be854.jpg,"Still Image","Hebden Bridge Camera Club - The Changing Face of Hebden Bridge",1,0
191,https://penninehorizons.org/items/show/191,"Bridge Lanes, Hebden Bridge, early  60s - AGW00110","Gas Lamp, Roof tops","Back High Street","Alan Greenwood","Alan Greenwood","Pennine Horizons Digital Archive",1960s,"Alan Greenwood","PHDA - Alan Greenwood Collection","Pennine Horizons Digital Archive","TIFF file 8-bit","English (U.K.)","Documentary photograph",AGW00110.tif,"Hebden Bridge",,,,,,,,,,,,,,,,,,,,,,,,,,,,,,,,,,,"1960s,Gas Lamp,Hebden Bridge,Roof tops",https://penninehorizons.org/files/original/475090e7aeb49ab99705a1e7fd81db6b.jpg,"Still Image","Alan Greenwood Collection",1,0
