﻿"Item Id","Item URI","Dublin Core:Title","Dublin Core:Subject","Dublin Core:Description","Dublin Core:Creator","Dublin Core:Source","Dublin Core:Publisher","Dublin Core:Date","Dublin Core:Contributor","Dublin Core:Rights","Dublin Core:Relation","Dublin Core:Format","Dublin Core:Language","Dublin Core:Type","Dublin Core:Identifier","Dublin Core:Coverage","Item Type Metadata:Lesson Plan Text","Item Type Metadata:Bibliography","Item Type Metadata:Biographical Text","Item Type Metadata:Occupation","Item Type Metadata:Death Date","Item Type Metadata:Birthplace","Item Type Metadata:Birth Date","Item Type Metadata:Participants","Item Type Metadata:Event Type","Item Type Metadata:URL","Item Type Metadata:Bit Rate/Frequency","Item Type Metadata:Interviewer","Item Type Metadata:Interviewee","Item Type Metadata:Location","Item Type Metadata:Transcription","Item Type Metadata:Local URL","Item Type Metadata:Original Format","Item Type Metadata:Physical Dimensions","Item Type Metadata:Duration","Item Type Metadata:Compression","Item Type Metadata:Producer","Item Type Metadata:Director","Item Type Metadata:Text","Item Type Metadata:Time Summary","Item Type Metadata:Email Body","Item Type Metadata:Subject Line","Item Type Metadata:From","Item Type Metadata:To","Item Type Metadata:CC","Item Type Metadata:BCC","Item Type Metadata:Number of Attachments","Item Type Metadata:Standards","Item Type Metadata:Objectives","Item Type Metadata:Materials",tags,file,itemType,collection,public,featured
10997,https://penninehorizons.org/items/show/10997,"view over Todmorden - BIM00180","Buildings, Co-operative  Building, Demolition, Places, Todmorden, Transport","August 2000","Bill Marsden","Bill Marsden","Pennine Horizons Digital Archive",1990s,,"PHDA - Bill Marsden Collection","Pennine Horizons Digital Archive","TIFF file 8-bit","English (U.K.)","Documentary photograph",BIM00180.tif,"Hebden Bridge",,,,,,,,,,,,,,,,,,,,,,,,,,,,,,,,,,,"Buildings,Co-operative  Building,Demolition,Todmorden,Transport",https://penninehorizons.org/files/original/7376fe76b76885e5eec49c11766bb663.jpg,"Still Image","Bill Marsden collection",1,0
10981,https://penninehorizons.org/items/show/10981,"View over Todmorden - BIM00164","Buildings, Places, Todmorden, Town Hall, Viaduct","Showing Todmorden Town Hall and the ralway viaduct.","Bill Marsden","Bill Marsden","Pennine Horizons Digital Archive",1990s,,"PHDA - Bill Marsden Collection","Pennine Horizons Digital Archive","TIFF file 8-bit","English (U.K.)","Documentary photograph",BIM00164.tif,"Hebden Bridge",,,,,,,,,,,,,,,,,,,,,,,,,,,,,,,,,,,"Buildings,Todmorden,Town Hall,Viaduct",https://penninehorizons.org/files/original/b2052513c97285a12181ec3c600f5ff4.jpg,"Still Image","Bill Marsden collection",1,0
8650,https://penninehorizons.org/items/show/8650,"View over Todmorden  - JSB00198","Buildings, Chimneys, Churches & Chapels, Mills, Mons Mill, Railway Viaduct, Railways, St Mary's, Todmorden, Town Hall",,"Possibly Nora Walton","Pennine Horizons Digital Archive","Pennine Horizons Digital Archive","No date yet","Steven Brook","PHDA - Steven Brook Collection","Pennine Horizons Digital Archive","TIFF file 8-bit","English (U.K.)","Documentary photograph",JSB00198.tif,Todmorden,,,,,,,,,,,,,,,,,,,,,,,,,,,,,,,,,,,"Chimneys,Church,Churches and Chapels,Mills,Mons Mill,Railway Viaduct,Railways,St Mary's,Todmorden,Town Hall",https://penninehorizons.org/files/original/ead763687a381b6101a547412d5ba87c.jpg,"Still Image","Steven Brook collection",1,0
22600,https://penninehorizons.org/items/show/22600,"View over Lydgate,Todmorden, 1980  - TNC00305.tif","Buildings, Copy Pit Line, Lydgate, Mill, Mills, Mons Mill, Railway, Railway Viaduct, Railway line, Railways, Todmorden","Lydgate or Nott Wood Railway viaduct with Mons Mill and chimney in the centre. The viaduct is on the Burnley Branch, or Copy Pit Line as it is known in railway circles, which opened in 1849.","Thomas Newell","Thomas Newell","Pennine Horizons Digital Archive","1980, 1980s",,"PHDA - Thomas Newell Collection","Pennine Horizons Digital Archive","TIFF file 8-bit","English (U.K.)","Documentary photograph",TNC00305.tif,,,,,,,,,,,,,,,,,,,,,,,,,,,,,,,,,,,,"Buildings,Copy Pit Line,Lydgate,Mill,Mills,Mons Mill,Railway,Railway line,Railway Viaduct,Railways,Todmorden",https://penninehorizons.org/files/original/9d9fa52a80b9aeec926ce07aa3269642.jpg,"Still Image","Thomas Newell collection",1,0
10462,https://penninehorizons.org/items/show/10462,"View over Derdale, Todmorden - MOT00134","Buildings, Canal, Canal Boat, Canals, Chimney, Chimneys, Mill, Mills, Railway, Railways, Todmorden, Transport, Viaduct","Panorama of the Derdale industrial area being served by barges on the Rochdale Canal. Centre left part of the town centre viaduct.",Unknown,"Todmorden Information Centre Trust","Pennine Horizons Digital Archive","1920, 1920s","Todmorden Information Centre Trust","PHDA - Todmorden Information Centre Trust","Pennine Horizons Digital Archive","TIFF file 8-bit","English (U.K.)","Documentary photograph",MOT00134.tif,Todmorden,,,,,,,,,,,,,,,,,,,,,,,,,,,,,,,,,,,"Buildings,Canal,Canal Boat,Chimney,Chimneys,Mill,Mills,Railway,Railways,Todmorden,Transport,Viaduct",https://penninehorizons.org/files/original/4da3c06f153c4ab185f1aaaf60c32253.jpg,"Still Image","The Making of Todmorden exhibition",1,0
36561,https://penninehorizons.org/items/show/36561,"View over Cloughfoot - CRN00428","CloughFoot, Gorpley Lane, Landscape, Snow, Todmorden","From Gorpley Lane, view over Cloughfoot, 2008",,,"Pennine Horizons Digital Archive",2016-11-26T10:39:35,,"PHDA - Christine Newell collection","Pennine Horizons Digital Archive","TIFF file 8-bit","English (U.K.)","Documentary photograph",CRN00428.jpg,,,,,,,,,,,,,,,,,,,,,,,,,,,,,,,,,,,,"CloughFoot,Gorpley Lane,Landscape,Snow,Todmorden",https://penninehorizons.org/files/original/ac2ab0fc2e1f227e5ceb3d4c2dfd4f77.jpg,"Still Image","Christine Newell collection",1,0
6348,https://penninehorizons.org/items/show/6348,"View of Todmorden - HLS01034","Buildings, Churches_&_Chapels, Mill, Places, Stoodley Pike, Todmorden, Town Hall, Townscape","Top left - Cross Stone Church. Bottom left - Town Hall, Bottom Right - Unitarian Chapel, Top Right - Stoodley Pike.",,,,"No date yet","PH34 - Hebden Bridge Local History Society","PHDA - Hebden Bridge Local History Society","Pennine Horizons Digital Archive","TIFF file 8-bit","English (U.K.)","Documentary photograph",HLS01034.tif,Todmorden,,,,,,,,,,,,,,,,,,,,,,,,,,,,,,,,,,,"Buildings,Churches and Chapels,Mill,Stoodley Pike,Todmorden,Town Hall,Townscape",https://penninehorizons.org/files/original/efb8674029c78d4bbaa119a6c07e002d.jpg,"Still Image","Hebden Bridge Local History Society",1,0
22595,https://penninehorizons.org/items/show/22595,"View of Stoodley Pike from Langfield Common, 1980  - TNC00300.tif","Landscape, Lumbutts Mill, Snow, Stoodley Pike, Todmorden","Winter view across Erringden; includes Lumbutts, Mankinholes,  and housing on Stoodley hospital site","Thomas Newell","Thomas Newell","Pennine Horizons Digital Archive","1980, 1980s",,"PHDA - Thomas Newell Collection","Pennine Horizons Digital Archive","TIFF file 8-bit","English (U.K.)","Documentary photograph",TNC00300.tif,,,,,,,,,,,,,,,,,,,,,,,,,,,,,,,,,,,,"Landscape,Lumbutts Mill,Snow,Stoodley Pike,Todmorden",https://penninehorizons.org/files/original/cf0dba2466bfe04c589d9d4c3a4a2701.jpg,"Still Image","Thomas Newell collection",1,0
10468,https://penninehorizons.org/items/show/10468,"View of Holebottom by A. F. Tait - MOT00141","Arts & Crafts, Buildings, Chimney, Chimneys, Church, Churches & Chapels, Churches_&_Chapels, Colour, Hay making, Horse & Cart, Mill, Mills, Minster, Painting, Places, Railway, Railway Viaduct, Railways, Todmorden","A general view from Holebottom showing the railway cutting across the centre of the town.  Clearly visible on the right are Christ Church and its Vicarage.   The former Ridgefoot Mill complex can be seen abutting the viaduct.

From a lithograph by A. F. Tait.","A. F. Tait","Todmorden Information Centre Trust","Pennine Horizons Digital Archive","1845, 1840s","Todmorden Information Centre Trust","PHDA - Todmorden Information Centre Trust","Pennine Horizons Digital Archive","TIFF file 8-bit","English (U.K.)","Documentary photograph",MOT00141.tif,Todmorden,,,,,,,,,,,,,,,,,,,,,,,,,,,,,,,,,,,"A. F. Tait,Arts and Crafts,Buildings,Chimney,Chimneys,Church,Churches and Chapels,Colour,Hay making,Horse & Cart,Mill,Mills,Minster,Painting,Railway,Railway Viaduct,Railways,Todmorden",https://penninehorizons.org/files/original/5a1d7db4f4e9c2e0d28d8e0101dd6423.jpg,"Still Image","The Making of Todmorden exhibition",1,0
23859,https://penninehorizons.org/items/show/23859,"View of Dobroyd - CRN00103","Dobroyd, Landscape, Sheep, Todmorden",,"Christine Newell","Christine Newell","Pennine Horizons Digital Archive","2001 , 2000s","Christine Newell","PHDA - Christine Newell Collection","Pennine Horizons Digital Archive","TIFF file 8-bit","English (U.K.)","Documentary photograph",CRN00103.tif,,,,,,,,,,,,,,,,,,,,,,,,,,,,,,,,,,,,"Dobroyd,Landscape,Sheep,Todmorden",https://penninehorizons.org/files/original/c5e6637381f5cdb65c7ab8ad6759f4de.jpg,"Still Image","Christine Newell collection",1,0
37057,https://penninehorizons.org/items/show/37057,"View of Centre Vale from Ferney Lee - TAS01552","Parks, Todmorden",,,,"Pennine Horizons Digital Archive",2014-10-05T18:42:27,,"PHDA - Todmorden Antiquarian Society","Pennine Horizons Digital Archive","TIFF file 8-bit","English (U.K.)","Documentary photograph",TAS01552.jpg,,,,,,,,,,,,,,,,,,,,,,,,,,,,,,,,,,,,"Parks,Todmorden",https://penninehorizons.org/files/original/c011cf269aabbba8a6606e34aa06159d.jpg,"Still Image","Todmorden General",1,0
30564,https://penninehorizons.org/items/show/30564,"View from Salford Way, Todmorden - CRN00346","Rochdale Road, Salford Way, Street Names, Todmorden, Unitarian Church, Waterside Lodge","The big building in the centre is Waterside Lodge Care Home with the spire of the Unitarian church behind.","Christine Newell","Pennine Horizons Digital Archive","Pennine Horizons Digital Archive",2016-10-26T11:22:00,,"PHDA - Christine Newell collection","Pennine Horizons Digital Archive","TIFF file 8-bit","English (U.K.)","Documentary photograph",CRN00346.tif,,,,,,,,,,,,,,,,,,,,,,,,,,,,,,,,,,,,"Rochdale Road,Salford Way,Street Names,Todmorden,Unitarian Church,Waterside Lodge",https://penninehorizons.org/files/original/df57bb1894c821508125db6b84e1aace.jpg,"Still Image","Christine Newell collection",1,0
24257,https://penninehorizons.org/items/show/24257,"View from London Road, Lumbutts - CRN00215","Butts Lane, Cattle, Landscape, London Road, Lumbutts, Paths & Tracks, Todmorden","Stansfield Villa & Butts Lane Area From London Road, Lumbutts","Christine Newell","Christine Newell","Pennine Horizons Digital Archive","2002 , 2000s","Christine Newell","PHDA - Christine Newell Collection","Pennine Horizons Digital Archive","TIFF file 8-bit","English (U.K.)","Documentary photograph",CRN00215.tif,,,,,,,,,,,,,,,,,,,,,,,,,,,,,,,,,,,,"Butts Lane,Cattle,Landscape,London Road,Lumbutts,Paths & Tracks,Todmorden",https://penninehorizons.org/files/original/fa668ca0b22a30ad9c1a1cae0d9b3f4d.jpg,"Still Image","Christine Newell collection",1,0
37119,https://penninehorizons.org/items/show/37119,"View from Eagles Crag  - TAS01614","Burnley Road, Todmorden","Frieldhurst Road is in the centre of the picture",,,"Pennine Horizons Digital Archive",2014-11-13T21:39:43,,"PHDA - Todmorden Antiquarian Society","Pennine Horizons Digital Archive","TIFF file 8-bit","English (U.K.)","Documentary photograph",TAS01614.jpg,,,,,,,,,,,,,,,,,,,,,,,,,,,,,,,,,,,,"Burnley Road,Todmorden",https://penninehorizons.org/files/original/f053c76128148ac20868b6ef9b3bf1ac.jpg,"Still Image","Todmorden General",1,0
22536,https://penninehorizons.org/items/show/22536,"View from Dobroyd, Todmorden, 1974 - TNC00241","Landscape, Todmorden",,"Thomas Newell","Thomas Newell","Pennine Horizons Digital Archive","1974, 1970s","Thomas Newell, Box 2","PHDA - Thomas Newell Collection","Pennine Horizons Digital Archive","TIFF file 8-bit","English (U.K.)","Documentary photograph",TNC00241.tif,,,,,,,,,,,,,,,,,,,,,,,,,,,,,,,,,,,,"Landscape,Todmorden",https://penninehorizons.org/files/original/31443a02362adda499171b63e8ea993e.jpg,"Still Image","Thomas Newell collection",1,0
24916,https://penninehorizons.org/items/show/24916,"Victoria Road, Todmorden. - RDA00205","Flood, Todmorden","Flood water at the junction of Garden Street and Victoria Road. Date unknown.",,"Rene Dawson","Pennine Horizons Digital Archive",,"Rene Dawson","PHDA - Rene Dawson Collection","Pennine Horizons Digital Archive","TIFF file 8-bit","English (U.K.)","Documentary photograph",RDA00205.TIF,,,,,,,,,,,,,,,,,,,,,,,,,,,,,,,,,,,,"Flood,Todmorden",https://penninehorizons.org/files/original/a323f4cec427e6e2553f29b000243d5a.jpg,"Still Image","Rene Dawson Collection",1,0
24915,https://penninehorizons.org/items/show/24915,"Victoria Road, Todmorden. - RDA00204","Flood, Todmorden","Flood water pouring down Victoria Road towards Burnley Road, Date unknown.",,"Rene Dawson","Pennine Horizons Digital Archive",,"Rene Dawson","PHDA - Rene Dawson Collection","Pennine Horizons Digital Archive","TIFF file 8-bit","English (U.K.)","Documentary photograph",RDA00204.TIF,,,,,,,,,,,,,,,,,,,,,,,,,,,,,,,,,,,,"Flood,Todmorden",https://penninehorizons.org/files/original/53e98c1cfdcebb923ec5eec0031971cd.jpg,"Still Image","Rene Dawson Collection",1,0
27367,https://penninehorizons.org/items/show/27367,"Victoria Road, Todmorden, c2007 - TAL00432","Street Names, Todmorden, Victoria Road","AN 34131818",,"Todmorden Antiquarian Society","Pennine Horizons Digital Archive",2007,,"PHDA - Todmorden Antiquarian Society","Pennine Horizons Digital Archive","TIFF file 8-bit","English (U.K.)","Documentary photograph",TAL00432.tif,,,,,,,,,,,,,,,,,,,,,,,,,,,,,,,,,,,,"Street Names,Todmorden,Victoria Road",https://penninehorizons.org/files/original/001175a9c9ae89489ae2c0a924389504.jpg,"Still Image","Todmorden Antiquarian Society Photographs at the Library",1,0
23949,https://penninehorizons.org/items/show/23949,"Very Cold Bath Water - CRN00198","Callis Wood, Snow, Todmorden",,"Christine Newell","Christine Newell","Pennine Horizons Digital Archive","2001 , 2000s","Christine Newell","PHDA - Christine Newell Collection","Pennine Horizons Digital Archive","TIFF file 8-bit","English (U.K.)","Documentary photograph",CRN00198.tif,,,,,,,,,,,,,,,,,,,,,,,,,,,,,,,,,,,,"Callis Wood,Snow,Todmorden",https://penninehorizons.org/files/original/227eb14ee5d4a0202a925497e0d7a54d.jpg,"Still Image","Christine Newell collection",1,0
27386,https://penninehorizons.org/items/show/27386,"Valentine Ball, 15th February 1963, with Mayor John Graham - TAL00456","Chain of Office, Event, Mayor, Todmorden, Town Hall, sculpture","AN 80188834",,"Todmorden Antiquarian Society","Pennine Horizons Digital Archive",1963,,"PHDA - Todmorden Antiquarian Society","Pennine Horizons Digital Archive","TIFF file 8-bit","English (U.K.)","Documentary photograph",TAL00456.tif,,,,,,,,,,,,,,,,,,,,,,,,,,,,,,,,,,,,"Chain of Office,Event,Mayor,sculpture,Todmorden,Town Hall",https://penninehorizons.org/files/original/880d99877031a50530b4f8bb68931bea.jpg,"Still Image","Todmorden Antiquarian Society Photographs at the Library",1,0
22591,https://penninehorizons.org/items/show/22591,"Vale, Todmorden, 1980  - TNC00296.tif","Burnley Road, Housing, Street Names, Todmorden, Vale","Stone terrace with double stepped gable end","Thomas Newell","Thomas Newell","Pennine Horizons Digital Archive","1980, 1980s",,"PHDA - Thomas Newell Collection","Pennine Horizons Digital Archive","TIFF file 8-bit","English (U.K.)","Documentary photograph",TNC00296.tif,,,,,,,,,,,,,,,,,,,,,,,,,,,,,,,,,,,,"Burnley Road,Housing,Street Names,Todmorden,Vale",https://penninehorizons.org/files/original/4b3a4be695d00d6e41de363a09dc500e.jpg,"Still Image","Thomas Newell collection",1,0
24945,https://penninehorizons.org/items/show/24945,"Vale, Cornholme, Todmorden. - RDA00234","Cornholme, Places, Todmorden","Looking across towards Cornholme Station which closed in 1938 with Burnley Road in the foreground.",,"Rene Dawson","Pennine Horizons Digital Archive",,"Rene Dawson","PHDA - Rene Dawson Collection","Pennine Horizons Digital Archive","TIFF file 8-bit","English (U.K.)","Documentary photograph",RDA00234.TIF,,,,,,,,,,,,,,,,,,,,,,,,,,,,,,,,,,,,"Cornholme,Places,Todmorden",https://penninehorizons.org/files/original/ad8849e4a15bba38a9934674e4cc0adf.jpg,"Still Image","Rene Dawson Collection",1,0
24934,https://penninehorizons.org/items/show/24934,"Vale, Cornholme, Todmorden. - RDA00223","Building, Cornholme, Mill, Mills, Places, Railway, Railways, Todmorden","Vale to the east of Cornholme.",,"Rene Dawson","Pennine Horizons Digital Archive",,"Rene Dawson","PHDA - Rene Dawson Collection","Pennine Horizons Digital Archive","TIFF file 8-bit","English (U.K.)","Documentary photograph",RDA00223.TIF,,,,,,,,,,,,,,,,,,,,,,,,,,,,,,,,,,,,"Building,Cornholme,Mill,Mills,Places,Railway,Railways,Todmorden",https://penninehorizons.org/files/original/cadf8e3bb95a85e1e6db6e10852f63a6.jpg,"Still Image","Rene Dawson Collection",1,0
32614,https://penninehorizons.org/items/show/32614,"Vale, Cornholme, Todmorden - TAS00443","Church, Churches & Chapels, Churches_&_Chapels, Minster, Railway, Railways, Todmorden","The rear of  Vale Baptist Chapel School is bottom right. During the first half of the 19th century there was a gradual movement from the hilltop villages down to the growing small mill towns in the valley bottom and in 1851 a small group from Shore Baptist Chapel on the hillside formed a congregation in Vale. The Chapel was opened in 1853 and enlarged in 1873 including the building of a Sunday School. In 1967 services ceased in the Chapel, which was then demolished, and the Sunday School was converted into a chapel and so it remains today (2015).",,,"Pennine Horizons Digital Archive",2014-09-26T19:37:31,,"PHDA - Todmorden Antiquarian Society","Pennine Horizons Digital Archive","TIFF file 8-bit","English (U.K.)","Documentary photograph",TAS00443.tif,,,,,,,,,,,,,,,,,,,,,,,,,,,,,,,,,,,,"Church,Churches & Chapels,Churches_&_Chapels,Minster,Railway,Railways,Todmorden",https://penninehorizons.org/files/original/44c227564450cfa5dfe8f29c1d2ea93a.jpg,"Still Image","Todmorden Churches & Chapels",1,0
22588,https://penninehorizons.org/items/show/22588,"Vale, 1980  - TNC00293.tif","Burnley Road, Churchyard, Graveyard, Street Names, Todmorden, Vale","Part of Vale Baptist Churchyard can see seen on the left.","Thomas Newell","Thomas Newell","Pennine Horizons Digital Archive","1980, 1980s",,"PHDA - Thomas Newell Collection","Pennine Horizons Digital Archive","TIFF file 8-bit","English (U.K.)","Documentary photograph",TNC00293.tif,,,,,,,,,,,,,,,,,,,,,,,,,,,,,,,,,,,,"Burnley Road,Churchyard,Graveyard,Street Names,Todmorden,Vale",https://penninehorizons.org/files/original/a41b8408ccdd892e94e864664ba61ed5.jpg,"Still Image","Thomas Newell collection",1,0
