﻿"Item Id","Item URI","Dublin Core:Title","Dublin Core:Subject","Dublin Core:Description","Dublin Core:Creator","Dublin Core:Source","Dublin Core:Publisher","Dublin Core:Date","Dublin Core:Contributor","Dublin Core:Rights","Dublin Core:Relation","Dublin Core:Format","Dublin Core:Language","Dublin Core:Type","Dublin Core:Identifier","Dublin Core:Coverage","Item Type Metadata:Lesson Plan Text","Item Type Metadata:Bibliography","Item Type Metadata:Biographical Text","Item Type Metadata:Occupation","Item Type Metadata:Death Date","Item Type Metadata:Birthplace","Item Type Metadata:Birth Date","Item Type Metadata:Participants","Item Type Metadata:Event Type","Item Type Metadata:URL","Item Type Metadata:Bit Rate/Frequency","Item Type Metadata:Interviewer","Item Type Metadata:Interviewee","Item Type Metadata:Location","Item Type Metadata:Transcription","Item Type Metadata:Local URL","Item Type Metadata:Original Format","Item Type Metadata:Physical Dimensions","Item Type Metadata:Duration","Item Type Metadata:Compression","Item Type Metadata:Producer","Item Type Metadata:Director","Item Type Metadata:Text","Item Type Metadata:Time Summary","Item Type Metadata:Email Body","Item Type Metadata:Subject Line","Item Type Metadata:From","Item Type Metadata:To","Item Type Metadata:CC","Item Type Metadata:BCC","Item Type Metadata:Number of Attachments","Item Type Metadata:Standards","Item Type Metadata:Objectives","Item Type Metadata:Materials",tags,file,itemType,collection,public,featured
2047,https://penninehorizons.org/items/show/2047,"Hebden Bridge Arts Festival 2012 - BLP00129","Entertainment, Guitar, Hebden Bridge, Hebden Bridge Arts Festival 2012, Musical Instrument, blu planet photo, blu planet photography, hebden bridge arts festival","Stealing Sheep.","Craig Shaw","Blue Planet Photography ","Pennine Horizons Digital Archive","2010s, 2012-07-03T21:38:34.00","Craig Shaw","PHDA - Craig Shaw Collection","Pennine Horizons Digital Archive","TIFF file 8-bit","English (U.K.)","Documentary photograph",BLP00129.tif,,,,,,,,,,,,,,,,,,,,,,,,,,,,,,,,,,,,"blu planet photo,blu planet photography,Entertainment,Guitar,Hebden Bridge,hebden bridge arts festival,Hebden Bridge Arts Festival 2012,Musical Instrument",https://penninehorizons.org/files/original/a292d649386d2537310cc875e4205a0a.jpg,"Still Image","Craig Shaw - Hebden Bridge Arts Festival 2012",1,0
2048,https://penninehorizons.org/items/show/2048,"Hebden Bridge Arts Festival 2012 - BLP00130","Entertainment, Hebden Bridge, Hebden Bridge Arts Festival 2012, blu planet photo, blu planet photography, hebden bridge arts festival","Stealing Sheep.","Craig Shaw","Blue Planet Photography ","Pennine Horizons Digital Archive","2010s, 2012-07-03T22:02:52.43","Craig Shaw","PHDA - Craig Shaw Collection","Pennine Horizons Digital Archive","TIFF file 8-bit","English (U.K.)","Documentary photograph",BLP00130.tif,,,,,,,,,,,,,,,,,,,,,,,,,,,,,,,,,,,,"blu planet photo,blu planet photography,Entertainment,Hebden Bridge,hebden bridge arts festival,Hebden Bridge Arts Festival 2012",https://penninehorizons.org/files/original/587ccd37b7e4c6e30cd8fd0fcbeb88b0.jpg,"Still Image","Craig Shaw - Hebden Bridge Arts Festival 2012",1,0
2049,https://penninehorizons.org/items/show/2049,"Hebden Bridge Arts Festival 2012 - BLP00131","Entertainment, Hebden Bridge Arts Festival 2012, Railway, Railway platforms, Railway station, Railways, Wheelbarrow",,"Craig Shaw","Blue Planet Photography ","Pennine Horizons Digital Archive","2010s, 2012-07-04T12:17:36.35","Craig Shaw","PHDA - Craig Shaw Collection","Pennine Horizons Digital Archive","TIFF file 8-bit","English (U.K.)","Documentary photograph",BLP00131.tif,,,,,,,,,,,,,,,,,,,,,,,,,,,,,,,,,,,,"Entertainment,Hebden Bridge Arts Festival 2012,Railway,Railway platforms,Railway station,Railways,Wheelbarrow",https://penninehorizons.org/files/original/0c6010123fe55643a1cacf3ca563176b.jpg,"Still Image","Craig Shaw - Hebden Bridge Arts Festival 2012",1,0
2050,https://penninehorizons.org/items/show/2050,"Hebden Bridge Arts Festival 2012 - BLP00132","Entertainment, Hebden Bridge Arts Festival 2012, Male","Mr Beaumont - musicologist, confidant and confirmed bachelor.","Craig Shaw","Blue Planet Photography ","Pennine Horizons Digital Archive","2010s, 2012-07-04T13:10:34.00","Craig Shaw","PHDA - Craig Shaw Collection","Pennine Horizons Digital Archive","TIFF file 8-bit","English (U.K.)","Documentary photograph",BLP00132.tif,,,,,,,,,,,,,,,,,,,,,,,,,,,,,,,,,,,,"Entertainment,Hebden Bridge Arts Festival 2012,Male",https://penninehorizons.org/files/original/cdad42970a783d2ba561752fc2462d8e.jpg,"Still Image","Craig Shaw - Hebden Bridge Arts Festival 2012",1,0
2051,https://penninehorizons.org/items/show/2051,"Hebden Bridge Arts Festival 2012 - BLP00133","Entertainment, Hebden Bridge Arts Festival 2012","Belly dancing lesson.","Craig Shaw","Blue Planet Photography ","Pennine Horizons Digital Archive","2010s, 2012-07-05T19:39:31.27","Craig Shaw","PHDA - Craig Shaw Collection","Pennine Horizons Digital Archive","TIFF file 8-bit","English (U.K.)","Documentary photograph",BLP00133.tif,,,,,,,,,,,,,,,,,,,,,,,,,,,,,,,,,,,,"Entertainment,Hebden Bridge Arts Festival 2012",https://penninehorizons.org/files/original/8b990114867f5fe7d1d07f74f7e61fe1.jpg,"Still Image","Craig Shaw - Hebden Bridge Arts Festival 2012",1,0
2052,https://penninehorizons.org/items/show/2052,"Hebden Bridge Arts Festival, 2012 - BLP00134","Entertainment, Event, Events, Hebden Bridge, Hebden Bridge Arts Festival 2012, Places, Public Houses, Pubs Inns & Hotels, St Georges Square, Street Names, Taverns, arts festival, blu planet photo, blu planet photography, events 2012","Events on 7th July, 2013","Craig Shaw","Blue Planet Photography ","Pennine Horizons Digital Archive","2010s, 2012-07-07T13:31:17.04","Craig Shaw","PHDA - Craig Shaw Collection","Pennine Horizons Digital Archive","TIFF file 8-bit","English (U.K.)","Documentary photograph",BLP00134.tif,,,,,,,,,,,,,,,,,,,,,,,,,,,,,,,,,,,,"arts festival,blu planet photo,blu planet photography,Entertainment,Event,Events,events 2012,Hebden Bridge,Hebden Bridge Arts Festival 2012,Public Houses,Pubs Inns and Hotels,St Georges Square,Street Names,Taverns",https://penninehorizons.org/files/original/de91854919529baa0856c318b2565478.jpg,"Still Image","Craig Shaw - Hebden Bridge Arts Festival 2012",1,0
2053,https://penninehorizons.org/items/show/2053,"Hebden Bridge Arts Festival 2012 - BLP00135","Entertainment, Event, Events, Hebden Bridge Arts Festival 2012, arts festival, blu planet photo, blu planet photography, events 2012","Festival events on 7th July, 2012","Craig Shaw","Blue Planet Photography ","Pennine Horizons Digital Archive","2010s, 2012-07-07T13:44:59.81","Craig Shaw","PHDA - Craig Shaw Collection","Pennine Horizons Digital Archive","TIFF file 8-bit","English (U.K.)","Documentary photograph",BLP00135.tif,,,,,,,,,,,,,,,,,,,,,,,,,,,,,,,,,,,,"arts festival,blu planet photo,blu planet photography,Entertainment,Event,Events,events 2012,Hebden Bridge Arts Festival 2012",https://penninehorizons.org/files/original/b289e32c58d7fff1aef2c2dc2cb020a5.jpg,"Still Image","Craig Shaw - Hebden Bridge Arts Festival 2012",1,0
2054,https://penninehorizons.org/items/show/2054,"Hebden Bridge Arts Festival 2012 - BLP00136","Entertainment, Event, Events, Hebden Bridge Arts Festival 2012, arts festival, blu planet photo, blu planet photography, events 2012","Festival events on 7th July, 2012","Craig Shaw","Blue Planet Photography ","Pennine Horizons Digital Archive","2010s, 2012-07-07T14:09:24.27","Craig Shaw","PHDA - Craig Shaw Collection","Pennine Horizons Digital Archive","TIFF file 8-bit","English (U.K.)","Documentary photograph",BLP00136.tif,,,,,,,,,,,,,,,,,,,,,,,,,,,,,,,,,,,,"arts festival,blu planet photo,blu planet photography,Entertainment,Event,Events,events 2012,Hebden Bridge Arts Festival 2012",https://penninehorizons.org/files/original/129d4f85f16b9a55e90a78d766a746ad.jpg,"Still Image","Craig Shaw - Hebden Bridge Arts Festival 2012",1,0
2055,https://penninehorizons.org/items/show/2055,"Hebden Bridge Arts Festival 2012 - BLP00138","Entertainment, Hebden Bridge Arts Festival 2012, Musical Instrument, Public Houses, Pubs Inns & Hotels, St Georges Square, Street Names, Taverns",,"Craig Shaw","Blue Planet Photography ","Pennine Horizons Digital Archive","2010s, 2012-07-08T13:12:12.04","Craig Shaw","PHDA - Craig Shaw Collection","Pennine Horizons Digital Archive","TIFF file 8-bit","English (U.K.)","Documentary photograph",BLP00138.tif,,,,,,,,,,,,,,,,,,,,,,,,,,,,,,,,,,,,"Entertainment,Hebden Bridge Arts Festival 2012,Musical Instrument,Public Houses,Pubs Inns and Hotels,St Georges Square,Street Names,Taverns",https://penninehorizons.org/files/original/76277df7af881259f0ae2a27aa7a8682.jpg,"Still Image","Craig Shaw - Hebden Bridge Arts Festival 2012",1,0
2056,https://penninehorizons.org/items/show/2056,"Hebden Bridge Arts Festival 2012 - BLP00139","Entertainment, Hebden Bridge Arts Festival 2012",,"Craig Shaw","Blue Planet Photography ","Pennine Horizons Digital Archive","2010s, 2012-07-08T15:01:11.79","Craig Shaw","PHDA - Craig Shaw Collection","Pennine Horizons Digital Archive","TIFF file 8-bit","English (U.K.)","Documentary photograph",BLP00139.tif,,,,,,,,,,,,,,,,,,,,,,,,,,,,,,,,,,,,"Entertainment,Hebden Bridge Arts Festival 2012",https://penninehorizons.org/files/original/541791537a832f70fa7b294062b8662c.jpg,"Still Image","Craig Shaw - Hebden Bridge Arts Festival 2012",1,0
2057,https://penninehorizons.org/items/show/2057,"Hebden Bridge Arts Festival 2012 - BLP00140","Entertainment, Guitar, Hebden Bridge Arts Festival 2012, Musical Instrument",,"Craig Shaw","Blue Planet Photography ","Pennine Horizons Digital Archive","2010s, 2012-07-08T20:57:45.33","Craig Shaw","PHDA - Craig Shaw Collection","Pennine Horizons Digital Archive","TIFF file 8-bit","English (U.K.)","Documentary photograph",BLP00140.tif,,,,,,,,,,,,,,,,,,,,,,,,,,,,,,,,,,,,"Entertainment,Guitar,Hebden Bridge Arts Festival 2012,Musical Instrument",https://penninehorizons.org/files/original/71680f817a2c9efb27ccc6b92b67b0aa.jpg,"Still Image","Craig Shaw - Hebden Bridge Arts Festival 2012",1,0
2058,https://penninehorizons.org/items/show/2058,"Hebden Bridge Arts Festival 2012 - BLP00141","Entertainment, Guitar, Hebden Bridge Arts Festival 2012, Musical Instrument",,"Craig Shaw","Blue Planet Photography ","Pennine Horizons Digital Archive","2010s, 2012-07-08T21:24:06.84","Craig Shaw","PHDA - Craig Shaw Collection","Pennine Horizons Digital Archive","TIFF file 8-bit","English (U.K.)","Documentary photograph",BLP00141.tif,,,,,,,,,,,,,,,,,,,,,,,,,,,,,,,,,,,,"Entertainment,Guitar,Hebden Bridge Arts Festival 2012,Musical Instrument",https://penninehorizons.org/files/original/6f39b926bffcb186171bcfd2a93ab714.jpg,"Still Image","Craig Shaw - Hebden Bridge Arts Festival 2012",1,0
7017,https://penninehorizons.org/items/show/7017,"Nativity Play, 27th Dec 1936 - HLS05510","Actors, Children, Costume, Entertainment, Event, People, stage","Mount Zion Primitive Methodist Church, Mytholmroyd.",,,,"1930s, 1936",,"PHDA - Hebden Bridge Local History Society","Pennine Horizons Digital Archive","TIFF file 8-bit","English (U.K.)","Documentary photograph",HLS05510.tif,,,,,,,,,,,,,,,,,,,,,,,,,,,,,,,,,,,,"Actor,Children,Costume,Entertainment,Event,Mount Zion Chapel,Mytholmroyd,Nativity,People,stage",https://penninehorizons.org/files/original/40f438fb8aee29050ccab3ed67bf84f8.jpg,"Still Image","Hebden Bridge Local History Society",1,0
7018,https://penninehorizons.org/items/show/7018,"Nativity Play, 27th Dec 1936 - HLS05511","Actors, Children, Costume, Entertainment, Event, People, stage","Mount Zion Primitive Methodist Church, Mytholmroyd.",,,,"1930s, 1936",,"PHDA - Hebden Bridge Local History Society","Pennine Horizons Digital Archive","TIFF file 8-bit","English (U.K.)","Documentary photograph",HLS05511.tif,,,,,,,,,,,,,,,,,,,,,,,,,,,,,,,,,,,,"Actor,Children,Costume,Entertainment,Event,Mount Zion Chapel,Mytholmroyd,Nativity,People,stage",https://penninehorizons.org/files/original/e8d7d1841f31a21716658f26938cadf9.jpg,"Still Image","Hebden Bridge Local History Society",1,0
7854,https://penninehorizons.org/items/show/7854,"River Holme Mill, Holmebridge - HPC00421","Buildings, Entertainment, Fire escape, Holmebridge, Mill, Mills","HU24

Photo taken c1985.","Harry Pogson","Pennine Horizons Digital Archive","Pennine Horizons Digital Archive","No date yet","Pennine Heritage","PHDA - Harry Pogson Collection","Pennine Horizons Digital Archive","TIFF file 8-bit","English (U.K.)","Documentary photograph",HPC00421.tif,,,,,,,,,,,,,,,,,,,,,,,,,,,,,,,,,,,,"Buildings,Entertainment,Fire escape,Holmebridge,Mill,Mills",https://penninehorizons.org/files/original/4e9aff7d181916aa0f23050fd3d82568.jpg,"Still Image","Harry Pogson collection",1,0
8435,https://penninehorizons.org/items/show/8435,"Easter Pace Egg Play, Hebden Bridge - JSB00106","Buildings, Carlton Building, Co-op Building, Co-operative Movement, Entertainment, Event, Hebden Bridge, Pace Eggers, Places, Pram, Retail, Shop, Shops, St Georges Square, Street Names, Water Tank, clock tower","Crowds gathering in St Georges Square Hebden Bridge for the Easter Pace Egg Play, c1975","Possibly Nora Walton","Pennine Horizons Digital Archive","Pennine Horizons Digital Archive","No date yet","Steven Brook","PHDA - Steven Brook Collection","Pennine Horizons Digital Archive","TIFF file 8-bit","English (U.K.)","Documentary photograph",JSB00106.tif,,,,,,,,,,,,,,,,,,,,,,,,,,,,,,,,,,,,"Buildings,Carlton Building,Clock tower,Co-op Building,Co-operative Movement,Entertainment,Event,Hebden Bridge,Pace Eggers,Pram,Retail,Shop,Shops,St Georges Square,Street Names,Water Tank",https://penninehorizons.org/files/original/f05b445a97895dae88f44b85feef8f92.jpg,"Still Image","Steven Brook collection",1,0
10329,https://penninehorizons.org/items/show/10329,"Set for Spark in Judea - LLG01044","Entertainment, Hebden Bridge, Little Theatre, Stage play, Theatre","Hebden Bridge Little Theatre 18th to 26th March 1955",,"Pennine Horizons Digital Archive","Pennine Horizons Digital Archive","1955, 1950s","Lloyd Greenwood","PHDA - Lloyd Greenwood Collection","Pennine Horizons Digital Archive","TIFF file 8-bit","English (U.K.)","Documentary photograph",LLG01044.tif,,,,,,,,,,,,,,,,,,,,,,,,,,,,,,,,,,,,"Entertainment,Hebden Bridge,Little Theatre,Stage play,Theatre",https://penninehorizons.org/files/original/88fa2b2bbfc9ef3778c26acefd2b12ca.jpg,"Still Image","Lloyd Greenwood collection",1,0
10330,https://penninehorizons.org/items/show/10330,"Spark in Judea  - LLG01045","Entertainment, Hebden Bridge, Little Theatre, Stage play, Theatre","Hebden Bridge Little Theatre 18th to 26th March 1955. Peter Iveson, Raymond Helliwell and Kathleen Leach",,"Pennine Horizons Digital Archive","Pennine Horizons Digital Archive","1955, 1950s","Lloyd Greenwood","PHDA - Lloyd Greenwood Collection","Pennine Horizons Digital Archive","TIFF file 8-bit","English (U.K.)","Documentary photograph",LLG01045.tif,,,,,,,,,,,,,,,,,,,,,,,,,,,,,,,,,,,,"Entertainment,Hebden Bridge,Little Theatre,Stage play,Theatre",https://penninehorizons.org/files/original/bbf358c8145dd7ca9617bf3f0d8d437a.jpg,"Still Image","Lloyd Greenwood collection",1,0
10331,https://penninehorizons.org/items/show/10331,"Spark in Judea  - LLG01046","Entertainment, Hebden Bridge, Little Theatre, Stage play, Theatre","Hebden Bridge Little Theatre 18th to 26th March 1955. Sheila Hardtley and Raymond Helliwell.",,"Pennine Horizons Digital Archive","Pennine Horizons Digital Archive","1955, 1950s","Lloyd Greenwood","PHDA - Lloyd Greenwood Collection","Pennine Horizons Digital Archive","TIFF file 8-bit","English (U.K.)","Documentary photograph",LLG01046.tif,,,,,,,,,,,,,,,,,,,,,,,,,,,,,,,,,,,,"Entertainment,Hebden Bridge,Little Theatre,Stage play,Theatre",https://penninehorizons.org/files/original/ba0bc85516c6bac2b3fb8bff96978238.jpg,"Still Image","Lloyd Greenwood collection",1,0
10332,https://penninehorizons.org/items/show/10332,"Spark in Judea  - LLG01047","Entertainment, Hebden Bridge, Little Theatre, Stage play, Theatre","Hebden Bridge Little Theatre 18th to 26th March 1955. Raymond Helliwell and Kathleen Leach.",,"Pennine Horizons Digital Archive","Pennine Horizons Digital Archive","1955, 1950s","Lloyd Greenwood","PHDA - Lloyd Greenwood Collection","Pennine Horizons Digital Archive","TIFF file 8-bit","English (U.K.)","Documentary photograph",LLG01047.tif,,,,,,,,,,,,,,,,,,,,,,,,,,,,,,,,,,,,"Entertainment,Hebden Bridge,Little Theatre,Stage play,Theatre",https://penninehorizons.org/files/original/b7047be4014b60156cf9af266dd2575b.jpg,"Still Image","Lloyd Greenwood collection",1,0
10335,https://penninehorizons.org/items/show/10335,"Set for Golden Rain - LLG01050","Entertainment, Hebden Bridge, Little Theatre, Stage play, Theatre","Hebden Bridge Little Theatre set for Golden Rain, 17th to 24th September 1955.",,"Pennine Horizons Digital Archive","Pennine Horizons Digital Archive","1955, 1950s","Lloyd Greenwood","PHDA - Lloyd Greenwood Collection","Pennine Horizons Digital Archive","TIFF file 8-bit","English (U.K.)","Documentary photograph",LLG01050.tif,,,,,,,,,,,,,,,,,,,,,,,,,,,,,,,,,,,,"Entertainment,Hebden Bridge,Little Theatre,Stage play,Theatre",https://penninehorizons.org/files/original/80c4a325dbad29781522477e061f2cb1.jpg,"Still Image","Lloyd Greenwood collection",1,0
10336,https://penninehorizons.org/items/show/10336,"Golden Rain - LLG01051","Entertainment, Hebden Bridge, Little Theatre, Stage play, Theatre","Hebden Bridge Little Theatre 17th to 24th September 1955. Nora Dodd, Doreen Hayhurst, Michael Rumble and Annice M. Crossley.",,"Pennine Horizons Digital Archive","Pennine Horizons Digital Archive","1955, 1950s","Lloyd Greenwood","PHDA - Lloyd Greenwood Collection","Pennine Horizons Digital Archive","TIFF file 8-bit","English (U.K.)","Documentary photograph",LLG01051.tif,,,,,,,,,,,,,,,,,,,,,,,,,,,,,,,,,,,,"Entertainment,Hebden Bridge,Little Theatre,Stage play,Theatre",https://penninehorizons.org/files/original/e14bc57d02a91370a42123315d2286d0.jpg,"Still Image","Lloyd Greenwood collection",1,0
10337,https://penninehorizons.org/items/show/10337,"Golden Rain - LLG01052","Entertainment, Hebden Bridge, Little Theatre, Stage play, Theatre","Hebden Bridge Little Theatre 17th to 24th September 1955. Annice Crossley, Norman Leach and Nora Dodd.",,"Pennine Horizons Digital Archive","Pennine Horizons Digital Archive","1955, 1950s","Lloyd Greenwood","PHDA - Lloyd Greenwood Collection","Pennine Horizons Digital Archive","TIFF file 8-bit","English (U.K.)","Documentary photograph",LLG01052.tif,,,,,,,,,,,,,,,,,,,,,,,,,,,,,,,,,,,,"Entertainment,Hebden Bridge,Little Theatre,Stage play,Theatre",https://penninehorizons.org/files/original/f4e7650595c73c074688eaf8b9563829.jpg,"Still Image","Lloyd Greenwood collection",1,0
10338,https://penninehorizons.org/items/show/10338,"Golden Rain - LLG01053","Entertainment, Hebden Bridge, Little Theatre, Stage play, Theatre","Hebden Bridge Little Theatre 17th to 24th September 1955. Alfred H. Stevenson, David Binns, Evelyn Hughes, Walter Wells, Michael Rumble, Doreen Hayhurst, Norman Leach, Annice Crossley and Nora Dodd.",,"Pennine Horizons Digital Archive","Pennine Horizons Digital Archive","1955, 1950s","Lloyd Greenwood","PHDA - Lloyd Greenwood Collection","Pennine Horizons Digital Archive","TIFF file 8-bit","English (U.K.)","Documentary photograph",LLG01053.tif,,,,,,,,,,,,,,,,,,,,,,,,,,,,,,,,,,,,"Entertainment,Hebden Bridge,Little Theatre,Stage play,Theatre",https://penninehorizons.org/files/original/04cdca4ac035af20e5a6698ab13d2084.jpg,"Still Image","Lloyd Greenwood collection",1,0
10341,https://penninehorizons.org/items/show/10341,"Set for Ring Round the Moon - LLG01056","Entertainment, Hebden Bridge, Little Theatre, Stage play, Theatre","Hebden Bridge Little Theatre, 19th November to 26th November 1955.",,"Pennine Horizons Digital Archive","Pennine Horizons Digital Archive","1955, 1950s","Lloyd Greenwood","PHDA - Lloyd Greenwood Collection","Pennine Horizons Digital Archive","TIFF file 8-bit","English (U.K.)","Documentary photograph",LLG01056.tif,,,,,,,,,,,,,,,,,,,,,,,,,,,,,,,,,,,,"Entertainment,Hebden Bridge,Little Theatre,Stage play,Theatre",https://penninehorizons.org/files/original/263b00665cc25f770671225bfc800ad0.jpg,"Still Image","Lloyd Greenwood collection",1,0
