﻿"Item Id","Item URI","Dublin Core:Title","Dublin Core:Subject","Dublin Core:Description","Dublin Core:Creator","Dublin Core:Source","Dublin Core:Publisher","Dublin Core:Date","Dublin Core:Contributor","Dublin Core:Rights","Dublin Core:Relation","Dublin Core:Format","Dublin Core:Language","Dublin Core:Type","Dublin Core:Identifier","Dublin Core:Coverage","Item Type Metadata:Lesson Plan Text","Item Type Metadata:Bibliography","Item Type Metadata:Biographical Text","Item Type Metadata:Occupation","Item Type Metadata:Death Date","Item Type Metadata:Birthplace","Item Type Metadata:Birth Date","Item Type Metadata:Participants","Item Type Metadata:Event Type","Item Type Metadata:URL","Item Type Metadata:Bit Rate/Frequency","Item Type Metadata:Interviewer","Item Type Metadata:Interviewee","Item Type Metadata:Location","Item Type Metadata:Transcription","Item Type Metadata:Local URL","Item Type Metadata:Original Format","Item Type Metadata:Physical Dimensions","Item Type Metadata:Duration","Item Type Metadata:Compression","Item Type Metadata:Producer","Item Type Metadata:Director","Item Type Metadata:Text","Item Type Metadata:Time Summary","Item Type Metadata:Email Body","Item Type Metadata:Subject Line","Item Type Metadata:From","Item Type Metadata:To","Item Type Metadata:CC","Item Type Metadata:BCC","Item Type Metadata:Number of Attachments","Item Type Metadata:Standards","Item Type Metadata:Objectives","Item Type Metadata:Materials",tags,file,itemType,collection,public,featured
14066,https://penninehorizons.org/items/show/14066," - ALC01407","Family, Group, People, Portrait","James Packard? and family. J.P.",,"Pennine Horizons Digital Archive","Pennine Horizons Digital Archive","No date yet",,"PHDA - Alice Longstaff Collection","Pennine Horizons Digital Archive","TIFF file 8-bit","English (U.K.)","Documentary photograph",ALC01407.tif,,,,,,,,,,,,,,,,,,,,,,,,,,,,,,,,,,,,"Family,Group,People,Portrait",https://penninehorizons.org/files/original/4e0f2248a32d78f0b42882d49da5d403.jpg,"Still Image","Alice Longstaff -  Gallery collection",1,0
22873,https://penninehorizons.org/items/show/22873,"A Seaside Holiday - RFC00119","Animals, Donkey, Family, Female, Group, People, Portrait, Woman, Women, friends, seascape","Rawson Family collection of glass negatives. C1890",Unknown,"Pennine Horizons Digital Archive","Pennine Horizons Digital Archive","No date yet",,"PHDA - Rawson Family Collection","Pennine Horizons Digital Archive","TIFF file 8-bit","English (U.K.)","Documentary photograph",RFC00119.tif,,,,,,,,,,,,,,,,,,,,,,,,,,,,,,,,,,,,"Animals,Donkey,Family,Female,friends,Group,People,Portrait,seascape,Woman,Women",https://penninehorizons.org/files/original/448c7b594145d5c6be03c01f6b0bc407.jpg,"Still Image","Rawson family collection",1,0
18580,https://penninehorizons.org/items/show/18580,"Ann and Lily Ashworth, 1949 - JET00165","Boy, Boys, Child, Children, Family, Girl, Girls, Group, Kid, People, Toddler",,,"Pennine Horizons Digital Archive","Pennine Horizons Digital Archive",1940s,"Jeanette Thomas","PHDA - Jeanette Thomas Collection","Pennine Horizons Digital Archive","TIFF file 8-bit","English (U.K.)","Documentary photograph",JET00165.tif,,,,,,,,,,,,,,,,,,,,,,,,,,,,,,,,,,,,"1940s,Boy,Child,Children,Family,Girl,Girls,Group,Kid,People,Toddler",https://penninehorizons.org/files/original/0ec9fece641d9ca6b4926472d76553d7.jpg,"Still Image","Jeanette Thomas collection",1,0
27730,https://penninehorizons.org/items/show/27730,"Annie May Greenwood with John and Harry - DEP00443","Family, People, Portrait, Studio","Annie May was born 20th April, 1915",,"Pennine Horizons Digital Archive","Pennine Horizons Digital Archive",,,"PHDA - Derek Pollard Collection","Pennine Horizons Digital Archive","TIFF file 8-bit","English (U.K.)","Documentary photograph",DEP00443.tif,,,,,,,,,,,,,,,,,,,,,,,,,,,,,,,,,,,,"Family,People,Portrait,Studio",https://penninehorizons.org/files/original/9cf107e1f4227fbde5eb9a6ba8717798.jpg,"Still Image","Derek Pollard collection",1,0
13946,https://penninehorizons.org/items/show/13946,"Family group - ALC01287","Boy, Boys, Child, Children, Family, Girl, Girls, Group, Kid, People, Toddler, Uniform","Back row 3rd from right in black tunic is Cecil Greenwood, he was scout master for 3rd Calder Valley. His trade in the 1960s was painter and decorator. In the 50s lived at Bankfoot Terrace, later Townfield Lane, Heptonstall. (S.Ballard)",,"Pennine Horizons Digital Archive","Pennine Horizons Digital Archive","No date yet",,"PHDA - Alice Longstaff Collection","Pennine Horizons Digital Archive","TIFF file 8-bit","English (U.K.)","Documentary photograph",ALC01287.tif,,,,,,,,,,,,,,,,,,,,,,,,,,,,,,,,,,,,"Boy,Child,Children,Family,Girl,Girls,Group,Kid,People,Toddler,Uniform",https://penninehorizons.org/files/original/8f3887d0dbbcd7a8f4c101f7f9ff6ea2.jpg,"Still Image","Alice Longstaff - Group portraits",1,0
13947,https://penninehorizons.org/items/show/13947,"Family group - ALC01288","Family, Group, People","Marian Lord (married to Jack Lord) 2nd right on back row. Ivy Pearson, 1st right on front row.",,"Pennine Horizons Digital Archive","Pennine Horizons Digital Archive","No date yet",,"PHDA - Alice Longstaff Collection","Pennine Horizons Digital Archive","TIFF file 8-bit","English (U.K.)","Documentary photograph",ALC01288.tif,,,,,,,,,,,,,,,,,,,,,,,,,,,,,,,,,,,,"Family,Group,People",https://penninehorizons.org/files/original/d4b6c3e37271723bd992750670cd221e.jpg,"Still Image","Alice Longstaff - Group portraits",1,0
22862,https://penninehorizons.org/items/show/22862,"Family Group - RFC00108","Family, Group, People, Portrait, friends","Unknown location. Rawson Family collection of glass negatives. C1890",Unknown,"Pennine Horizons Digital Archive","Pennine Horizons Digital Archive","No date yet",,"PHDA - Rawson Family Collection","Pennine Horizons Digital Archive","TIFF file 8-bit","English (U.K.)","Documentary photograph",RFC00108.tif,,,,,,,,,,,,,,,,,,,,,,,,,,,,,,,,,,,,"Family,friends,Group,People,Portrait",https://penninehorizons.org/files/original/c2de4977ad2305da151537a17f3aedc6.jpg,"Still Image","Rawson family collection",1,0
22864,https://penninehorizons.org/items/show/22864,"Family Group - RFC00110","Boy, Boys, Child, Children, Family, Girl, Girls, Group, Kid, People, Portrait, Toddler","Unknown location. Rawson Family collection of glass negatives. C1890",Unknown,"Pennine Horizons Digital Archive","Pennine Horizons Digital Archive","No date yet",,"PHDA - Rawson Family Collection","Pennine Horizons Digital Archive","TIFF file 8-bit","English (U.K.)","Documentary photograph",RFC00110.tif,,,,,,,,,,,,,,,,,,,,,,,,,,,,,,,,,,,,"Boy,Child,Children,Family,Girl,Girls,Group,Kid,People,Portrait,Toddler",https://penninehorizons.org/files/original/9cecd5a4f5be5e2e71529ad0c471851e.jpg,"Still Image","Rawson family collection",1,0
22886,https://penninehorizons.org/items/show/22886,"Family Group - RFC00132","Boy, Boys, Child, Children, Family, Girl, Girls, Group, Kid, People, Portrait, Toddler, friends","Rawson Family collection of glass negatives. C1890",Unknown,"Pennine Horizons Digital Archive","Pennine Horizons Digital Archive","No date yet",,"PHDA - Rawson Family Collection","Pennine Horizons Digital Archive","TIFF file 8-bit","English (U.K.)","Documentary photograph",RFC00132.tif,,,,,,,,,,,,,,,,,,,,,,,,,,,,,,,,,,,,"Boy,Child,Children,Family,friends,Girl,Girls,Group,Kid,People,Portrait,Toddler",https://penninehorizons.org/files/original/e87d7a6dfae3f3117b5225522e342627.jpg,"Still Image","Rawson family collection",1,0
22888,https://penninehorizons.org/items/show/22888,"Family Group - RFC00134","Animals, Boy, Boys, Child, Children, Dogs, Family, Girl, Girls, Group, Kid, People, Toddler, friends","Rawson Family collection of glass negatives. C1890",Unknown,"Pennine Horizons Digital Archive","Pennine Horizons Digital Archive","No date yet",,"PHDA - Rawson Family Collection","Pennine Horizons Digital Archive","TIFF file 8-bit","English (U.K.)","Documentary photograph",RFC00134.tif,,,,,,,,,,,,,,,,,,,,,,,,,,,,,,,,,,,,"Animals,Boy,Child,Children,Dog,Dogs,Family,friends,Girl,Girls,Group,Kid,People,Toddler",https://penninehorizons.org/files/original/d8731822cac271aa29e3a61e1c8f507c.jpg,"Still Image","Rawson family collection",1,0
22893,https://penninehorizons.org/items/show/22893,"Family Group - RFC00139","Boy, Boys, Child, Children, Dog, Family, Girl, Girls, Group, Kid, People, Portrait, Toddler, friends","Rawson Family collection of glass negatives. C1890",Unknown,"Pennine Horizons Digital Archive","Pennine Horizons Digital Archive","No date yet",,"PHDA - Rawson Family Collection","Pennine Horizons Digital Archive","TIFF file 8-bit","English (U.K.)","Documentary photograph",RFC00139.tif,,,,,,,,,,,,,,,,,,,,,,,,,,,,,,,,,,,,"Boy,Child,Children,Dog,Family,friends,Girl,Girls,Group,Group portrait,Kid,People,Portrait,Toddler",https://penninehorizons.org/files/original/7fcc8b5958d80058949f3835ae438ec9.jpg,"Still Image","Rawson family collection",1,0
17931,https://penninehorizons.org/items/show/17931,"Family Home - ALC06359","Boy, Boys, Child, Children, Family, Girl, Girls, House, Kid, People, Toddler","Can anybody identify?",,"Pennine Horizons Digital Archive","Pennine Horizons Digital Archive","No date yet",434,"PHDA - Alice Longstaff Collection","Pennine Horizons Digital Archive","TIFF file 8-bit","English (U.K.)","Documentary photograph",ALC06359.tif,,,,,,,,,,,,,,,,,,,,,,,,,,,,,,,,,,,,"Boy,Child,Children,Family,Girl,Girls,House,Kid,People,Toddler",https://penninehorizons.org/files/original/53e77c2dcd1ac1f95afdd489c705b26c.jpg,"Still Image","Alice Longstaff - General Pictures",1,0
18578,https://penninehorizons.org/items/show/18578,"Fred, Allan, Lily and Ann Ashworth, 1949 - JET00163","Family, Group, People",,,"Pennine Horizons Digital Archive","Pennine Horizons Digital Archive",1940s,"Jeanette Thomas","PHDA - Jeanette Thomas Collection","Pennine Horizons Digital Archive","TIFF file 8-bit","English (U.K.)","Documentary photograph",JET00163.tif,,,,,,,,,,,,,,,,,,,,,,,,,,,,,,,,,,,,"1940s,Family,Group,People",https://penninehorizons.org/files/original/56e20525e57c42938d88eb855cffa0ac.jpg,"Still Image","Jeanette Thomas collection",1,0
22891,https://penninehorizons.org/items/show/22891,"Group of Children - RFC00137","Children, Family, Female, Group, People, Portrait, Woman, Women, friends","Rawson Family collection of glass negatives. C1890",Unknown,"Pennine Horizons Digital Archive","Pennine Horizons Digital Archive","No date yet",,"PHDA - Rawson Family Collection","Pennine Horizons Digital Archive","TIFF file 8-bit","English (U.K.)","Documentary photograph",RFC00137.tif,,,,,,,,,,,,,,,,,,,,,,,,,,,,,,,,,,,,"Children,Family,Female,friends,Group,People,Portrait,Woman,Women",https://penninehorizons.org/files/original/2b6c71e6066ab0ecc4daebe3d3178838.jpg,"Still Image","Rawson family collection",1,0
22858,https://penninehorizons.org/items/show/22858,"Haugh End, Sowerby Bridge - RFC00104","Family, Haugh End, House, People, winter","Rawson Family collection of glass negatives. C1890",Unknown,"Pennine Horizons Digital Archive","Pennine Horizons Digital Archive","No date yet",,"PHDA - Rawson Family Collection","Pennine Horizons Digital Archive","TIFF file 8-bit","English (U.K.)","Documentary photograph",RFC00104.tif,,,,,,,,,,,,,,,,,,,,,,,,,,,,,,,,,,,,"Family,Haugh End,House,People,winter",https://penninehorizons.org/files/original/c2822e24a3fb72e15e4c8af1d8e0dcaa.jpg,"Still Image","Rawson family collection",1,0
22859,https://penninehorizons.org/items/show/22859,"Haugh End, Sowerby Bridge - RFC00105","Family, Haugh End, House, People, Snow","Rawson Family collection of glass negatives. C1890",Unknown,"Pennine Horizons Digital Archive","Pennine Horizons Digital Archive","No date yet",,"PHDA - Rawson Family Collection","Pennine Horizons Digital Archive","TIFF file 8-bit","English (U.K.)","Documentary photograph",RFC00105.tif,,,,,,,,,,,,,,,,,,,,,,,,,,,,,,,,,,,,"Family,Haugh End,House,People,Snow",https://penninehorizons.org/files/original/cb8e608b30284e5c97b59b5a0deabfc4.jpg,"Still Image","Rawson family collection",1,0
22868,https://penninehorizons.org/items/show/22868,"John Selwyn Rawson  - RFC00114","Family, Male, People, Portrait, friends, moustache","Rawson Family collection of glass negatives. C1890",Unknown,"Pennine Horizons Digital Archive","Pennine Horizons Digital Archive","No date yet",,"PHDA - Rawson Family Collection","Pennine Horizons Digital Archive","TIFF file 8-bit","English (U.K.)","Documentary photograph",RFC00114.tif,,,,,,,,,,,,,,,,,,,,,,,,,,,,,,,,,,,,"Family,friends,Male,moustache,People,Portrait",https://penninehorizons.org/files/original/1ac3d07907d60156bd98c56cecbabd1e.jpg,"Still Image","Rawson family collection",1,0
18579,https://penninehorizons.org/items/show/18579,"Lily, Allan, Fred and Ann Ashworth, c1949 - JET00164","Family, Group, People",,,"Pennine Horizons Digital Archive","Pennine Horizons Digital Archive",1940s,"Jeanette Thomas","PHDA - Jeanette Thomas Collection","Pennine Horizons Digital Archive","TIFF file 8-bit","English (U.K.)","Documentary photograph",JET00164.tif,,,,,,,,,,,,,,,,,,,,,,,,,,,,,,,,,,,,"1940s,Family,Group,People",https://penninehorizons.org/files/original/e8b4cf3360ed0632fea1fac7ce76789e.jpg,"Still Image","Jeanette Thomas collection",1,0
22857,https://penninehorizons.org/items/show/22857,"Little Boy on Wooden horse - RFC00103","Children, Family, Male, People, Portrait, Toy, friends","Rawson Family collection of glass negatives. C1890",Unknown,"Pennine Horizons Digital Archive","Pennine Horizons Digital Archive","No date yet",,"PHDA - Rawson Family Collection","Pennine Horizons Digital Archive","TIFF file 8-bit","English (U.K.)","Documentary photograph",RFC00103.tif,,,,,,,,,,,,,,,,,,,,,,,,,,,,,,,,,,,,"Children,Family,friends,Male,People,Portrait,Toy",https://penninehorizons.org/files/original/999fddcf0cb6ecf240fc89ee88208535.jpg,"Still Image","Rawson family collection",1,0
22866,https://penninehorizons.org/items/show/22866,"Mother & Child - RFC00112","Baby, Child, Dog, Family, Group, People, Portrait, friends","Rawson Family collection of glass negatives. C1890",Unknown,"Pennine Horizons Digital Archive","Pennine Horizons Digital Archive","No date yet",,"PHDA - Rawson Family Collection","Pennine Horizons Digital Archive","TIFF file 8-bit","English (U.K.)","Documentary photograph",RFC00112.tif,,,,,,,,,,,,,,,,,,,,,,,,,,,,,,,,,,,,"Baby,Child,Dog,Family,friends,Group,People,Portrait",https://penninehorizons.org/files/original/d4401632e80f180b1dacdf0389922737.jpg,"Still Image","Rawson family collection",1,0
14805,https://penninehorizons.org/items/show/14805,"Parents and children - ALC02154","Family, Name, People, Portrait, Toddler","OH84/39 & 40. Helena at back, son, grandson and mother 1960. John Shepherd, little boy. He was about 60 in 1993. Helena Chadwick was 25 when this photo was taken. Mrs Chadwick, Helen's mother.",,"Pennine Horizons Digital Archive","Pennine Horizons Digital Archive","No date yet",,"PHDA - Alice Longstaff Collection","Pennine Horizons Digital Archive","TIFF file 8-bit","English (U.K.)","Documentary photograph",ALC02154.tif,,,,,,,,,,,,,,,,,,,,,,,,,,,,,,,,,,,,"Family,Name,People,Portrait,Toddler",https://penninehorizons.org/files/original/69031f6bfdbaa3f262240a41e494bcf0.jpg,"Still Image","Alice Longstaff - Parents & children portraits",1,0
14923,https://penninehorizons.org/items/show/14923,"Parents and children - ALC02272","Family, People, Toddler",,,"Pennine Horizons Digital Archive","Pennine Horizons Digital Archive","No date yet",,"PHDA - Alice Longstaff Collection","Pennine Horizons Digital Archive","TIFF file 8-bit","English (U.K.)","Documentary photograph",ALC02272.tif,,,,,,,,,,,,,,,,,,,,,,,,,,,,,,,,,,,,"Family,People,Toddler",https://penninehorizons.org/files/original/4c0e4a2ffdf72a6cb6c55dc88474e29b.jpg,"Still Image","Alice Longstaff - Parents & children portraits",1,0
22894,https://penninehorizons.org/items/show/22894,"Portrait of a Baby - RFC00140","Baby, Child, Family, People, Portrait, friends","Rawson Family collection of glass negatives. C1890",Unknown,"Pennine Horizons Digital Archive","Pennine Horizons Digital Archive","No date yet",,"PHDA - Rawson Family Collection","Pennine Horizons Digital Archive","TIFF file 8-bit","English (U.K.)","Documentary photograph",RFC00140.tif,,,,,,,,,,,,,,,,,,,,,,,,,,,,,,,,,,,,"Baby,Child,Family,friends,People,Portrait",https://penninehorizons.org/files/original/bafeeac71b0bb8d6d1fdc22c0b6588ce.jpg,"Still Image","Rawson family collection",1,0
22890,https://penninehorizons.org/items/show/22890,"Portrait of a Child - RFC00136","Child, Family, People, Portrait, friends","Rawson Family collection of glass negatives. C1890",Unknown,"Pennine Horizons Digital Archive","Pennine Horizons Digital Archive","No date yet",,"PHDA - Rawson Family Collection","Pennine Horizons Digital Archive","TIFF file 8-bit","English (U.K.)","Documentary photograph",RFC00136.tif,,,,,,,,,,,,,,,,,,,,,,,,,,,,,,,,,,,,"Child,Family,friends,People,Portrait",https://penninehorizons.org/files/original/70126f640122d2de84ce1bc77e6febcb.jpg,"Still Image","Rawson family collection",1,0
22855,https://penninehorizons.org/items/show/22855,"Portrait of a Couple - RFC00101","Family, People, Portrait","Friends/Family,unknown location. Rawson Family collection of glass negatives. C1890",Unknown,"Pennine Horizons Digital Archive","Pennine Horizons Digital Archive","No date yet",,"PHDA - Rawson Family Collection","Pennine Horizons Digital Archive","TIFF file 8-bit","English (U.K.)","Documentary photograph",RFC00101.tif,,,,,,,,,,,,,,,,,,,,,,,,,,,,,,,,,,,,"Family,People,Portrait",https://penninehorizons.org/files/original/954b6545b9a1b13f59c6e10af796064d.jpg,"Still Image","Rawson family collection",1,0
