﻿"Item Id","Item URI","Dublin Core:Title","Dublin Core:Subject","Dublin Core:Description","Dublin Core:Creator","Dublin Core:Source","Dublin Core:Publisher","Dublin Core:Date","Dublin Core:Contributor","Dublin Core:Rights","Dublin Core:Relation","Dublin Core:Format","Dublin Core:Language","Dublin Core:Type","Dublin Core:Identifier","Dublin Core:Coverage","Item Type Metadata:Lesson Plan Text","Item Type Metadata:Bibliography","Item Type Metadata:Biographical Text","Item Type Metadata:Occupation","Item Type Metadata:Death Date","Item Type Metadata:Birthplace","Item Type Metadata:Birth Date","Item Type Metadata:Participants","Item Type Metadata:Event Type","Item Type Metadata:URL","Item Type Metadata:Bit Rate/Frequency","Item Type Metadata:Interviewer","Item Type Metadata:Interviewee","Item Type Metadata:Location","Item Type Metadata:Transcription","Item Type Metadata:Local URL","Item Type Metadata:Original Format","Item Type Metadata:Physical Dimensions","Item Type Metadata:Duration","Item Type Metadata:Compression","Item Type Metadata:Producer","Item Type Metadata:Director","Item Type Metadata:Text","Item Type Metadata:Time Summary","Item Type Metadata:Email Body","Item Type Metadata:Subject Line","Item Type Metadata:From","Item Type Metadata:To","Item Type Metadata:CC","Item Type Metadata:BCC","Item Type Metadata:Number of Attachments","Item Type Metadata:Standards","Item Type Metadata:Objectives","Item Type Metadata:Materials",tags,file,itemType,collection,public,featured
27015,https://penninehorizons.org/items/show/27015,"The Lodge at the entrance to Hardcastle Crags - STW00155","Feature, Forest, Hardcastle Crags, Landscape, Lodge, Midgehole, Woodland, Woodlands, Woods",,Various,"Steve Wood","Pennine Horizons Digital Archive",,"Steve Wood","PHDA - Steve Wood Collection","Pennine Horizons Digital Archive","TIFF file 8-bit","English (U.K.)","Documentary photograph",STW00155.tif,,,,,,,,,,,,,,,,,,,,,,,,,,,,,,,,,,,,"Feature,Forest,Hardcastle Crags,Landscape,Lodge,Midgehole,Woodland,Woodlands,Woods",https://penninehorizons.org/files/original/0359aca45ba92e63d7f43355f81ad4eb.jpg,"Still Image","Steve Wood Collection",1,0
27016,https://penninehorizons.org/items/show/27016,"The Lodge at the entrance to Hardcastle Crags - STW00156","Feature, Forest, Hardcastle Crags, Landscape, Lodge, Midgehole, Woodland, Woodlands, Woods",,Various,"Steve Wood","Pennine Horizons Digital Archive",,"Steve Wood","PHDA - Steve Wood Collection","Pennine Horizons Digital Archive","TIFF file 8-bit","English (U.K.)","Documentary photograph",STW00156.tif,,,,,,,,,,,,,,,,,,,,,,,,,,,,,,,,,,,,"Feature,Forest,Hardcastle Crags,Landscape,Lodge,Midgehole,Woodland,Woodlands,Woods",https://penninehorizons.org/files/original/c083a73322d3511aaa229e2ac41b1891.jpg,"Still Image","Steve Wood Collection",1,0
27017,https://penninehorizons.org/items/show/27017,"The Lodge at the entrance to Hardcastle Crags - STW00157","Feature, Forest, Hardcastle Crags, Landscape, Lodge, Midgehole, Woodland, Woodlands, Woods",,Various,"Steve Wood","Pennine Horizons Digital Archive",,"Steve Wood","PHDA - Steve Wood Collection","Pennine Horizons Digital Archive","TIFF file 8-bit","English (U.K.)","Documentary photograph",STW00157.tif,,,,,,,,,,,,,,,,,,,,,,,,,,,,,,,,,,,,"Feature,Forest,Hardcastle Crags,Landscape,Lodge,Midgehole,Woodland,Woodlands,Woods",https://penninehorizons.org/files/original/9c05e76b93b893f49e81a4805748768c.jpg,"Still Image","Steve Wood Collection",1,0
27018,https://penninehorizons.org/items/show/27018,"The Lodge at the entrance to Hardcastle Crags - STW00158","Feature, Forest, Hardcastle Crags, Landscape, Lodge, Midgehole, Woodland, Woodlands, Woods",,Various,"Steve Wood","Pennine Horizons Digital Archive",,"Steve Wood","PHDA - Steve Wood Collection","Pennine Horizons Digital Archive","TIFF file 8-bit","English (U.K.)","Documentary photograph",STW00158.tif,,,,,,,,,,,,,,,,,,,,,,,,,,,,,,,,,,,,"Feature,Forest,Hardcastle Crags,Landscape,Lodge,Midgehole,Woodland,Woodlands,Woods",https://penninehorizons.org/files/original/ccb1c867f80c65e0e2dc59bfa19bbcdf.jpg,"Still Image","Steve Wood Collection",1,0
27019,https://penninehorizons.org/items/show/27019,"The Lodge at the entrance to Hardcastle Crags - STW00159","Feature, Forest, Hardcastle Crags, Landscape, Lodge, Midgehole, Tent, Woodland, Woodlands, Woods",,Various,"Steve Wood","Pennine Horizons Digital Archive",,"Steve Wood","PHDA - Steve Wood Collection","Pennine Horizons Digital Archive","TIFF file 8-bit","English (U.K.)","Documentary photograph",STW00159.tif,,,,,,,,,,,,,,,,,,,,,,,,,,,,,,,,,,,,"Feature,Forest,Hardcastle Crags,Landscape,Lodge,Midgehole,Tent,Woodland,Woodlands,Woods",https://penninehorizons.org/files/original/4a86b8c36ad56ed9fac4ef74c6a48c6b.jpg,"Still Image","Steve Wood Collection",1,0
27020,https://penninehorizons.org/items/show/27020,"The Lodge at the entrance to Hardcastle Crags - STW00160","Feature, Forest, Hardcastle Crags, Landscape, Lodge, Midgehole, Woodland, Woodlands, Woods",,Various,"Steve Wood","Pennine Horizons Digital Archive",,"Steve Wood","PHDA - Steve Wood Collection","Pennine Horizons Digital Archive","TIFF file 8-bit","English (U.K.)","Documentary photograph",STW00160.tif,,,,,,,,,,,,,,,,,,,,,,,,,,,,,,,,,,,,"Feature,Forest,Hardcastle Crags,Landscape,Lodge,Midgehole,Woodland,Woodlands,Woods",https://penninehorizons.org/files/original/55a743e05266cf4e22b9b6e9a6ac55ff.jpg,"Still Image","Steve Wood Collection",1,0
27021,https://penninehorizons.org/items/show/27021,"The Lodge at the entrance to Hardcastle Crags - STW00161","Colour, Feature, Forest, Hardcastle Crags, Landscape, Lodge, Midgehole, Woodland, Woodlands, Woods",,Various,"Steve Wood","Pennine Horizons Digital Archive",,"Steve Wood","PHDA - Steve Wood Collection","Pennine Horizons Digital Archive","TIFF file 8-bit","English (U.K.)","Documentary photograph",STW00161.tif,,,,,,,,,,,,,,,,,,,,,,,,,,,,,,,,,,,,"Colour,Feature,Forest,Hardcastle Crags,Landscape,Lodge,Midgehole,Woodland,Woodlands,Woods",https://penninehorizons.org/files/original/6c07527bc915c0be26caddf5d8646a93.jpg,"Still Image","Steve Wood Collection",1,0
27022,https://penninehorizons.org/items/show/27022,"The Lodge at the entrance to Hardcastle Crags - STW00162","Colour, Feature, Forest, Hardcastle Crags, Landscape, Lodge, Midgehole, Woodland, Woodlands, Woods",,Various,"Steve Wood","Pennine Horizons Digital Archive",,"Steve Wood","PHDA - Steve Wood Collection","Pennine Horizons Digital Archive","TIFF file 8-bit","English (U.K.)","Documentary photograph",STW00162.tif,,,,,,,,,,,,,,,,,,,,,,,,,,,,,,,,,,,,"Colour,Feature,Forest,Hardcastle Crags,Landscape,Lodge,Midgehole,Woodland,Woodlands,Woods",https://penninehorizons.org/files/original/da051b173e2685af3e760d3167446815.jpg,"Still Image","Steve Wood Collection",1,0
27023,https://penninehorizons.org/items/show/27023,"The Lodge at the entrance to Hardcastle Crags - STW00163","Colour, Feature, Forest, Hardcastle Crags, Landscape, Lodge, Midgehole, Woodland, Woodlands, Woods",,Various,"Steve Wood","Pennine Horizons Digital Archive",,"Steve Wood","PHDA - Steve Wood Collection","Pennine Horizons Digital Archive","TIFF file 8-bit","English (U.K.)","Documentary photograph",STW00163.tif,,,,,,,,,,,,,,,,,,,,,,,,,,,,,,,,,,,,"Colour,Feature,Forest,Hardcastle Crags,Landscape,Lodge,Midgehole,Woodland,Woodlands,Woods",https://penninehorizons.org/files/original/8aae509e266c6efeb012dc71a804f77c.jpg,"Still Image","Steve Wood Collection",1,0
27024,https://penninehorizons.org/items/show/27024,"The Lodge at the entrance to Hardcastle Crags - STW00164","Colour, Feature, Forest, Hardcastle Crags, Landscape, Lodge, Midgehole, Woodland, Woodlands, Woods",,Various,"Steve Wood","Pennine Horizons Digital Archive",,"Steve Wood","PHDA - Steve Wood Collection","Pennine Horizons Digital Archive","TIFF file 8-bit","English (U.K.)","Documentary photograph",STW00164.tif,,,,,,,,,,,,,,,,,,,,,,,,,,,,,,,,,,,,"Colour,Feature,Forest,Hardcastle Crags,Landscape,Lodge,Midgehole,Woodland,Woodlands,Woods",https://penninehorizons.org/files/original/233439b9fcba8a391f471f994c6fbc1f.jpg,"Still Image","Steve Wood Collection",1,0
27025,https://penninehorizons.org/items/show/27025,"The Lodge at the entrance to Hardcastle Crags - STW00165","Colour, Feature, Forest, Hardcastle Crags, Landscape, Lodge, Midgehole, Woodland, Woodlands, Woods",,Various,"Steve Wood","Pennine Horizons Digital Archive",,"Steve Wood","PHDA - Steve Wood Collection","Pennine Horizons Digital Archive","TIFF file 8-bit","English (U.K.)","Documentary photograph",STW00165.tif,,,,,,,,,,,,,,,,,,,,,,,,,,,,,,,,,,,,"Colour,Feature,Forest,Hardcastle Crags,Landscape,Lodge,Midgehole,Woodland,Woodlands,Woods",https://penninehorizons.org/files/original/e7bedeecbb7a061bbb9886acbd7672e1.jpg,"Still Image","Steve Wood Collection",1,0
27026,https://penninehorizons.org/items/show/27026,"The Lodge at the entrance to Hardcastle Crags - STW00166","Colour, Feature, Forest, Hardcastle Crags, Landscape, Lodge, Midgehole, Woodland, Woodlands, Woods",,Various,"Steve Wood","Pennine Horizons Digital Archive",,"Steve Wood","PHDA - Steve Wood Collection","Pennine Horizons Digital Archive","TIFF file 8-bit","English (U.K.)","Documentary photograph",STW00166.tif,,,,,,,,,,,,,,,,,,,,,,,,,,,,,,,,,,,,"Colour,Feature,Forest,Hardcastle Crags,Landscape,Lodge,Midgehole,Woodland,Woodlands,Woods",https://penninehorizons.org/files/original/18bc1eb1b57fd709aad3a2faf0e2b974.jpg,"Still Image","Steve Wood Collection",1,0
27027,https://penninehorizons.org/items/show/27027,"The Lodge at the entrance to Hardcastle Crags - STW00167","Colour, Feature, Forest, Hardcastle Crags, Landscape, Lodge, Midgehole, Woodland, Woodlands, Woods","C066.551 Lodge Milton",Various,"Steve Wood","Pennine Horizons Digital Archive",,"Steve Wood","PHDA - Steve Wood Collection","Pennine Horizons Digital Archive","TIFF file 8-bit","English (U.K.)","Documentary photograph",STW00167.tif,,,,,,,,,,,,,,,,,,,,,,,,,,,,,,,,,,,,"Colour,Feature,Forest,Hardcastle Crags,Landscape,Lodge,Midgehole,Woodland,Woodlands,Woods",https://penninehorizons.org/files/original/4f61d09befa1a3055f23291824435964.jpg,"Still Image","Steve Wood Collection",1,0
27028,https://penninehorizons.org/items/show/27028,"The Lodge at the entrance to Hardcastle Crags - STW00168","Colour, Feature, Forest, Hardcastle Crags, Landscape, Lodge, Midgehole, Woodland, Woodlands, Woods","C067.655 Lodge Halls",Various,"Steve Wood","Pennine Horizons Digital Archive",,"Steve Wood","PHDA - Steve Wood Collection","Pennine Horizons Digital Archive","TIFF file 8-bit","English (U.K.)","Documentary photograph",STW00168.tif,,,,,,,,,,,,,,,,,,,,,,,,,,,,,,,,,,,,"Colour,Feature,Forest,Hardcastle Crags,Landscape,Lodge,Midgehole,Woodland,Woodlands,Woods",https://penninehorizons.org/files/original/3354c43e93639338f7892ffca5ebb8c8.jpg,"Still Image","Steve Wood Collection",1,0
27029,https://penninehorizons.org/items/show/27029,"The Lodge at the entrance to Hardcastle Crags - STW00169","Feature, Forest, Hardcastle Crags, Landscape, Lodge, Midgehole, Woodland, Woodlands, Woods","C068.666 Lodge",Various,"Steve Wood","Pennine Horizons Digital Archive",,"Steve Wood","PHDA - Steve Wood Collection","Pennine Horizons Digital Archive","TIFF file 8-bit","English (U.K.)","Documentary photograph",STW00169.tif,,,,,,,,,,,,,,,,,,,,,,,,,,,,,,,,,,,,"Feature,Forest,Hardcastle Crags,Landscape,Lodge,Midgehole,Woodland,Woodlands,Woods",https://penninehorizons.org/files/original/8f512ca953356e03c09a7f3511d6b76b.jpg,"Still Image","Steve Wood Collection",1,0
27030,https://penninehorizons.org/items/show/27030,"The Lodge at the entrance to Hardcastle Crags - STW00170","Colour, Feature, Forest, Hardcastle Crags, Landscape, Lodge, Midgehole, Woodland, Woodlands, Woods","C069.735 Lodge Stewart & Woolf",Various,"Steve Wood","Pennine Horizons Digital Archive",,"Steve Wood","PHDA - Steve Wood Collection","Pennine Horizons Digital Archive","TIFF file 8-bit","English (U.K.)","Documentary photograph",STW00170.tif,,,,,,,,,,,,,,,,,,,,,,,,,,,,,,,,,,,,"Colour,Feature,Forest,Hardcastle Crags,Landscape,Lodge,Midgehole,Woodland,Woodlands,Woods",https://penninehorizons.org/files/original/a35dd49cae66317b57365ec8be8874eb.jpg,"Still Image","Steve Wood Collection",1,0
27199,https://penninehorizons.org/items/show/27199,"The Lodge House at Stansfield Hall, Todmorden - TAL00245","Lodge, Snow, Stansfield Hall, Todmorden","AN 70083204",,"Todmorden Antiquarian Society","Pennine Horizons Digital Archive",,,"PHDA - Todmorden Antiquarian Society","Pennine Horizons Digital Archive","TIFF file 8-bit","English (U.K.)","Documentary photograph",TAL00245.tif,,,,,,,,,,,,,,,,,,,,,,,,,,,,,,,,,,,,"Lodge,Snow,Stansfield Hall,Todmorden",https://penninehorizons.org/files/original/c6c45f275a244b8cec8d3c2bf72e89f1.jpg,"Still Image","Todmorden Antiquarian Society Photographs at the Library",1,0
30527,https://penninehorizons.org/items/show/30527,"Lodge Gate House, Dobroyd Castle, Todmorden - CRN00308","Building, Buildings, Dobroyd Castle, Lodge, Todmorden",,"Christine Newell","Pennine Horizons Digital Archive","Pennine Horizons Digital Archive",2003,,"PHDA - Christine Newell collection","Pennine Horizons Digital Archive","TIFF file 8-bit","English (U.K.)","Documentary photograph",CRN00308.tif,,,,,,,,,,,,,,,,,,,,,,,,,,,,,,,,,,,,"Building,Buildings,Dobroyd Castle,Lodge,Todmorden",https://penninehorizons.org/files/original/eea723d3231d495631e1a82a552fd603.jpg,"Still Image","Christine Newell collection",1,0
32974,https://penninehorizons.org/items/show/32974,"Lumbutts Mill and Dam - TAS00959","Building, Dam, Lodge, Lumbutts, Lumbutts Mill, Mill, Mills, Todmorden",,,,"Pennine Horizons Digital Archive",2014-11-13T20:17:14,,"PHDA - Todmorden Antiquarian Society","Pennine Horizons Digital Archive","TIFF file 8-bit","English (U.K.)","Documentary photograph",TAS00959.tif,,,,,,,,,,,,,,,,,,,,,,,,,,,,,,,,,,,,"Building,Dam,Lodge,Lumbutts,Lumbutts Mill,Mill,Mills,Todmorden",https://penninehorizons.org/files/original/cf9e0359c399a56c9add5aafa7c7d059.jpg,"Still Image","Todmorden Mills",1,0
33722,https://penninehorizons.org/items/show/33722,"Postcard of Hardcastle Crags - WMH00136","Hardcastle Crags, Hebden Water, Lellos, Lodge, Midgehole, New Bridge, River, Weir","Postcard stamped November 1907. On the right is the lodge at the entrace to Hardcastle Crags. On the left above the houses is New Bridge Mill, originally a water powered cotton mill but in the 1890s part converted into Lello's Tearooms to cater for the vast number of visitors who came to the Crags. The building facing the river had large lettering on it visible from the Crags entrance advertising the tearooms.",,"Pennine Horizons Digital Archive","Pennine Horizons Digital Archive",,"William Henwood","PHDA - William Henwood Collection","Pennine Horizons Digital Archive","TIFF file 8-bit","English (U.K.)","Documentary photograph",WMH00136.tif,,,,,,,,,,,,,,,,,,,,,,,,,,,,,,,,,,,,"Hardcastle Crags,Hebden Water,Lellos,Lodge,Midgehole,new bridge,River,Weir",https://penninehorizons.org/files/original/3818b0aab06ec269c5d09cfcf9943070.jpg,"Still Image","William Henwood collection",1,0
33730,https://penninehorizons.org/items/show/33730,"New Bridge, Midgehole from Heptonstall - WMH00169","Hardcastle Crags, Hollins, Lodge, Middle Dean, New Bridge, New Bridge Mill","Undated postcard. Looking up Crimsworth Dean. Below centre is the Lodge and entrance to Hardcastle Crags with the drive through the Crags going off to the left. Bottom left is New Bridge Mill a former water powered cotton mill part of which became Tea Rooms from the 1890s until the First World War; it was demolished 1950s.","Lilywhite Ltd. Brighouse.","Pennine Horizons Digital Archive","Pennine Horizons Digital Archive",,"William Henwood","PHDA - William Henwood Collection","Pennine Horizons Digital Archive","TIFF file 8-bit","English (U.K.)","Documentary photograph",WMH00169.tif,,,,,,,,,,,,,,,,,,,,,,,,,,,,,,,,,,,,"Hardcastle Crags,Hollins,Lodge,Middle Dean,new bridge,New Bridge Mill",https://penninehorizons.org/files/original/db7dd0b1cf746d5ca9edcb922d0de469.jpg,"Still Image","William Henwood collection",1,0
33732,https://penninehorizons.org/items/show/33732,"New Bridge, Midgehole, Hebden Bridge. - WMH00194","Hardcastle Crags, Hebden Bridge, Lodge, Midgehole, New Bridge, New Bridge Mill, Postcard","Undated postcard. Looking up Crimsworth Dean with Midgehole and New Bridge Mill bottom centre of the picture and the Lodge and gates to Hardcastle Crags above.",,"Pennine Horizons Digital Archive","Pennine Horizons Digital Archive",,"William Henwood","PHDA - William Henwood Collection","Pennine Horizons Digital Archive","TIFF file 8-bit","English (U.K.)","Documentary photograph",WMH00194.tif,,,,,,,,,,,,,,,,,,,,,,,,,,,,,,,,,,,,"Hardcastle Crags,Hebden Bridge,Lodge,Midgehole,new bridge,New Bridge Mill,Postcard",https://penninehorizons.org/files/original/57d0a3b40b8ad900232d42261c7deb55.jpg,"Still Image","William Henwood collection",1,0
33734,https://penninehorizons.org/items/show/33734,"The Lodge, Hardcastle Crags, Hebden Bridge. - WMH00208","Hardcastle Crags, Hebden Bridge, Lodge, Midgehole, New Bridge Mill","Postcard with August 1925 postmark. Looking over New Bridge, Midgehole, up to Crimsworth Dean. Bottom left the roof of New Bridge Mill, a former water powered cotton mill, and centre right the entrance to the Crags.",,"Pennine Horizons Digital Archive","Pennine Horizons Digital Archive",,"William Henwood","PHDA - William Henwood Collection","Pennine Horizons Digital Archive","TIFF file 8-bit","English (U.K.)","Documentary photograph",WMH00208.tif,,,,,,,,,,,,,,,,,,,,,,,,,,,,,,,,,,,,"Hardcastle Crags,Hebden Bridge,Lodge,Midgehole,New Bridge Mill",https://penninehorizons.org/files/original/36a1f3addf5a2bc783f6507cdc0767d9.jpg,"Still Image","William Henwood collection",1,0
33744,https://penninehorizons.org/items/show/33744,"Postcard of Hardcastle Crags - WMH00234","Hardcastle Crags, Lodge, Midgehole",,,"Pennine Horizons Digital Archive","Pennine Horizons Digital Archive",,"William Henwood","PHDA - William Henwood Collection","Pennine Horizons Digital Archive","TIFF file 8-bit","English (U.K.)","Documentary photograph",WMH00234.tif,,,,,,,,,,,,,,,,,,,,,,,,,,,,,,,,,,,,"Hardcastle Crags,Lodge,Midgehole",https://penninehorizons.org/files/original/96e6ff347f9541503452e57a0807880a.jpg,"Still Image","William Henwood collection",1,0
34027,https://penninehorizons.org/items/show/34027,"Queen Street Mill - PNH01141","Building, Lodge, Mill, Mills, Queen Street, Street Names",,,,"Pennine Horizons Digital Archive",,,"PHDA - Pennine Heritage Collection","Pennine Horizons Digital Archive","TIFF file 8-bit","English (U.K.)","Documentary photograph",PNH01141.tif,,,,,,,,,,,,,,,,,,,,,,,,,,,,,,,,,,,,"Building,Lodge,Mill,Mills,Queen Street,Street Names",https://penninehorizons.org/files/original/b2a29149c6642b6b94f212a9c025106b.jpg,"Still Image","Pennine Heritage Collection",1,0
