﻿"Item Id","Item URI","Dublin Core:Title","Dublin Core:Subject","Dublin Core:Description","Dublin Core:Creator","Dublin Core:Source","Dublin Core:Publisher","Dublin Core:Date","Dublin Core:Contributor","Dublin Core:Rights","Dublin Core:Relation","Dublin Core:Format","Dublin Core:Language","Dublin Core:Type","Dublin Core:Identifier","Dublin Core:Coverage","Item Type Metadata:Lesson Plan Text","Item Type Metadata:Bibliography","Item Type Metadata:Biographical Text","Item Type Metadata:Occupation","Item Type Metadata:Death Date","Item Type Metadata:Birthplace","Item Type Metadata:Birth Date","Item Type Metadata:Participants","Item Type Metadata:Event Type","Item Type Metadata:URL","Item Type Metadata:Bit Rate/Frequency","Item Type Metadata:Interviewer","Item Type Metadata:Interviewee","Item Type Metadata:Location","Item Type Metadata:Transcription","Item Type Metadata:Local URL","Item Type Metadata:Original Format","Item Type Metadata:Physical Dimensions","Item Type Metadata:Duration","Item Type Metadata:Compression","Item Type Metadata:Producer","Item Type Metadata:Director","Item Type Metadata:Text","Item Type Metadata:Time Summary","Item Type Metadata:Email Body","Item Type Metadata:Subject Line","Item Type Metadata:From","Item Type Metadata:To","Item Type Metadata:CC","Item Type Metadata:BCC","Item Type Metadata:Number of Attachments","Item Type Metadata:Standards","Item Type Metadata:Objectives","Item Type Metadata:Materials",tags,file,itemType,collection,public,featured
267,https://penninehorizons.org/items/show/267,"Part of Bridge Gate, Hebden Bridge - AGW00186","Bridge Gate, Buildings, Carlton Building, Hebden Water, Public Houses, Pubs Inns & Hotels, Retail, River, Shop, Shops, Street Names, Taverns, White Swan","Taken from the terrace of the Town Hall","Alan Greenwood","Alan Greenwood","Pennine Horizons Digital Archive",2012-10-13T11:11:04,"Alan Greenwood","PHDA - Alan Greenwood Collection","Pennine Horizons Digital Archive","TIFF file 8-bit","English (U.K.)","Documentary photograph",AGW00186.TIF,"Hebden Bridge",,,,,,,,,,,,,,,,,,,,,,,,,,,,,,,,,,,"Bridge Gate,Buildings,Carlton Building,Hebden Bridge,Hebden Water,Public Houses,Pubs Inns and Hotels,Retail,River,Shop,Shops,Street Names,Taverns,White Swan",https://penninehorizons.org/files/original/f05609345ee7e63caf2df2e223f1d44d.jpg,"Still Image","Alan Greenwood Collection",1,0
5483,https://penninehorizons.org/items/show/5483,"Bridge Lanes, Hebden Bridge - HBC00538 ","Bridge Lanes, Hebden Bridge, Places, Street Names","The bottom of Heptonstall road can be seen just right of centre. Taken in the 1960s after the High Street houses had been demolished.","Alan Greenwood","Hebden Bridge Camera Club","Pennine Horizons Digital Archive",1960s,"Hebden Bridge Camera Club","PHDA - Hebden Bridge Camera Club","Pennine Horizons Digital Archive","TIFF file 8-bit","English (U.K.)","Documentary photograph",HBC00538.tif,,,,,,,,,,,,,,,,,,,,,,,,,,,,,,,,,,,,"Bridge Lanes,Hebden Bridge,Street Names",https://penninehorizons.org/files/original/1a7d4ade0a11b2862c9f752d7db6ebab.jpg,"Still Image","Hebden Bridge Camera Club - The Changing Face of Hebden Bridge",1,0
13189,https://penninehorizons.org/items/show/13189,"Hebden Bridge - Stubbings Steps - ALC00369","Albert Street, Buildings, Carlton Building, Cars, Commercial Street, Gas Lamps, Hebden Bridge, Places, Retail, Road, Shop, Shops, Street Names, Stubbings Steps, Transport","Stubbings Steps from School Street down to Commercial Street in the 1950s. The building at the bottom was originally the toll bar house on the Lees and Hebden Bridge Turnpike Road.

Recalling the days of moody black and white films such as “Room at the Top” and “A Kind of Loving” Alan Greenwood captured an evocative moment in time in his wonderful photo, “Descent,” taken in 1962. The young man descending the steps at Birchcliffe is Keith Astin: ahead of him lies Hebden Bridge town centre where delights such as the Co-operative Central Store, centre, beckon! Old code No. AT373AG.","Alan Greenwood","Pennine Horizons Digital Archive","Pennine Horizons Digital Archive",1950s,,"PHDA - Alice Longstaff Collection","Pennine Horizons Digital Archive","TIFF file 8-bit","English (U.K.)","Documentary photograph",ALC00369.tif,,,,,,,,,,,,,,,,,,,,,,,,,,,,,,,,,,,,"Albert Street,Buildings,Carlton Building,Cars,Commercial Street,Gas Lamps,Hebden Bridge,Retail,Road,Shop,Shops,Street Names,Stubbings Steps,Transport",https://penninehorizons.org/files/original/a5d98761338958dde7490d630cd6366a.jpg,"Still Image","Alice Longstaff - General Pictures",1,0
23151,https://penninehorizons.org/items/show/23151,"Hebden Bridge Times Office - DEF00233","Church, Churches & Chapels, Churches_&_Chapels, Ebenezer Baptist Chapel, Hebden Bridge, Hebden Bridge Times, Market Street, Minster, Places, Street Names, Sundial House","The former Ebenezer Chapel on Market Street, Hebden Bridge. The Latin inscription on the sun dial reads ""What thou seekest is a shadow"". The Hebden Bridge Times moved out many years ago to Crown Street and now no longer have an office in the town!","Alan Greenwood","Pennine Horizons Digital Archive","Pennine Horizons Digital Archive","No date yet","David Fletcher","PHDA - David Fletcher Collection","Pennine Horizons Digital Archive","TIFF file 8-bit","English (U.K.)","Documentary photograph",DEF00233.tif,,,,,,,,,,,,,,,,,,,,,,,,,,,,,,,,,,,,"Church,Churches & Chapels,Churches_&_Chapels,Ebenezer Baptist Chapel,Hebden Bridge,Hebden Bridge Times,Market Street,Minster,Places,Sign,Street Names,Sundial House,Text",https://penninehorizons.org/files/original/e7080de95817e9701439c6d68f407910.jpg,"Still Image","David Fletcher collection",1,0
23202,https://penninehorizons.org/items/show/23202,"Hebden Bridge Times Office - DEF00285","Church, Churches & Chapels, Churches_&_Chapels, Ebenezer Baptist Chapel, Hebden Bridge, Hebden Bridge Times, Market Street, Minster, Places, Street Names","Market Street, Hebden Bridge. The former Ebenezer Chapel. Now a gallery and the Hebden Bridge Times no longer has a presence in the town! <a href=""http://theafteraliceproject.org/items/show/2451"" title=""LINK"">See it now.</a><br /><br /> The following text is taken from Looking Back at Hebden Bridge by Frank Horsfall &amp; Terry Wyke The first church established by the Particular Baptists in Hebden Bridge was Ebenezer Chapel which was opened in 1777 due to the efforts of Rev. John Fawcett. Fawcett, who had previously been minister of the Wainsgate Chapel, was a leading figure in the Baptists movement and despite offers of more eminent posts he remained at Ebenezer until his death in 1817. His work at Brearley Hall and later at Ewood Hall to train men for the Baptist ministry led to the establishment of the Northern Baptist Education Society. John Foster, the essayist, was one of his best-remembered pupils. After his death the congregation at Ebenezer continued to grow and it was decided to erect a new chapel. Hope Chapel was opened in 1858 and the photograph shows Hope at around that time. However, the old chapel was not immediately closed down, it continued to be used as a Sunday School, and later as Hebden Hall it was a popular venue for public meetings. In the late 1880s it was occupied by the publishers, Kershaw and Ashworth, and for many years the Hebden Bridge Times was printed from these premises. In more recent times, this part of Market Street has been widened and the chapel graveyard has been tidied up, although sufficient stones remain to remind visitors to the antique shops, which now occupy the chapel, of the ancestry of one of Hebden Bridge’s historically important buildings.","Alan Greenwood","Pennine Horizons Digital Archive","Pennine Horizons Digital Archive","No date yet","David Fletcher","PHDA - David Fletcher Collection","Pennine Horizons Digital Archive","TIFF file 8-bit","English (U.K.)","Documentary photograph",DEF00285.tif,,,,,,,,,,,,,,,,,,,,,,,,,,,,,,,,,,,,"Church,Churches & Chapels,Churches_&_Chapels,Ebenezer Baptist Chapel,Hebden Bridge,Hebden Bridge Times,Market Street,Minster,Places,Street Names",https://penninehorizons.org/files/original/78b9da83991bebcd4051eacab1e3ef6c.jpg,"Still Image","David Fletcher collection",1,0
24811,https://penninehorizons.org/items/show/24811,"Hebden Bridge - Stubbings Steps – AGW00233","Albert Street, Building, Carlton Building, Cars, Commercial Street, Gas Lamps, Hebden Bridge, Places, Retail, Road, Shop, Shops, Street Names, Stubbings Steps, Transport","Stubbings Steps from School Street down to Commercial Street in the 1950s. The building at the bottom was originally the toll bar house on the Leeds and Hebden Bridge Turnpike Road.","Alan Greenwood","Alan Greenwood","Pennine Horizons Digital Archive",1950s,"Alan Greenwood","PHDA - Alan Greenwood Collection","Pennine Horizons Digital Archive","jpg file 8-bit","English (U.K.)","Documentary photograph",AGW00233.tif,,,,,,,,,,,,,,,,,,,,,,,,,,,,,,,,,,,,"Albert Street,Building,Carlton Building,Cars,Commercial Street,Gas Lamps,Hebden Bridge,Places,Retail,Road,Shop,Shops,Street Names,Stubbings Steps,Transport",https://penninehorizons.org/files/original/3f193910e7d26f34c911562ec47a342a.jpg,"Still Image","Alan Greenwood Collection",1,0
26223,https://penninehorizons.org/items/show/26223,"Mytholmroyd Methodist Church - AGW00234","Hall Bank Lane, Mytholmroyd, Mytholmroyd Farm, Places, Scout Road, Street Names","Mytholmroyd Farm is on the left.","Alan Greenwood ","Alan Greenwood","Pennine Horizons Digital Archive","2008, 2000s",,"PHDA – Alan Greenwood Collection","Pennine Horizons Digital Archive","TIFF file 8-bit","English (U.K.)","Documentary photograph",AGW00234.tif,,,,,,,,,,,,,,,,,,,,,,,,,,,,,,,,,,,,"Hall Bank Lane,Mytholmroyd,Mytholmroyd Farm,Places,Scout Road,Street Names",https://penninehorizons.org/files/original/1ec9a37e5c9ea1be744a31f38e42b431.jpg,"Still Image","Alan Greenwood Collection",1,0
26245,https://penninehorizons.org/items/show/26245,"Clough Mill, Mytholmroyd, 1960 - AGW00256","Burnley Road, Chimney, Chimneys, Clough Mill, Mytholmroyd, Places, Street Names","This was a weaving shed, adjacent to Burnley Road. Now the site of Russell Dean furniture retailers","Alan Greenwood ","Alan Greenwood","Pennine Horizons Digital Archive","1960, 1960s",,"PHDA – Alan Greenwood Collection","Pennine Horizons Digital Archive","TIFF file 8-bit","English (U.K.)","Documentary photograph",AGW00256.tif,,,,,,,,,,,,,,,,,,,,,,,,,,,,,,,,,,,,"Burnley Road,Chimney,Chimneys,Clough Mill,Mytholmroyd,Places,Street Names",https://penninehorizons.org/files/original/b6210c55a58c7da071a1cb03d8d93fef.jpg,"Still Image","Alan Greenwood Collection",1,0
26248,https://penninehorizons.org/items/show/26248,"Midgley Road, Mytholmroyd. c1959. - AGW00259","Church, Churches & Chapels, Churches_&_Chapels, Clough Mill, Midgley Road, Minster, Mytholmroyd, Places, St Michaels Church, Street Names","Showing the narrow entrance to Midgely Road. When Clough Mill, shown on the left, was demolished the road was widened.","Alan Greenwood ","Alan Greenwood","Pennine Horizons Digital Archive","1959, 1950s",,"PHDA – Alan Greenwood Collection","Pennine Horizons Digital Archive","TIFF file 8-bit","English (U.K.)","Documentary photograph",AGW00259.tif,,,,,,,,,,,,,,,,,,,,,,,,,,,,,,,,,,,,"Church,Churches & Chapels,Churches_&_Chapels,Clough Mill,Midgley Road,Minster,Mytholmroyd,Places,St Michaels Church,Street Names",https://penninehorizons.org/files/original/0a6a9ab683521c404a31209234c31f65.jpg,"Still Image","Alan Greenwood Collection",1,0
26376,https://penninehorizons.org/items/show/26376,"Russell Dean's Furniture Store, Mytholmroyd - AGW00278","Building, Burnley Road, Midgley Road, Mytholmroyd, Places, Retail, Shop, Shops, Street Names","The store is built on the site of the former Clough Mill which was demolished in the 1960s to allow for the widening of the entrance to Midgley Road.","Alan Greenwood ","Alan Greenwood","Pennine Horizons Digital Archive",2006,,"PHDA - Alan Greenwood Collection","Pennine Horizons Digital Archive","TIFF file 8-bit","English (U.K.)","Documentary photograph",AGW00278.tif,,,,,,,,,,,,,,,,,,,,,,,,,,,,,,,,,,,,"Building,Burnley Road,Midgley Road,Mytholmroyd,Places,Retail,Shop,Shops,Street Names",https://penninehorizons.org/files/original/38380616fe68831487ce06851214d1ba.jpg,"Still Image","Alan Greenwood Collection",1,0
26377,https://penninehorizons.org/items/show/26377,"Russell Dean's Furniture Store, Mytholmroyd - AGW00279","Building, Burnley Road, Midgley Road, Mytholmroyd, Places, Retail, Shop, Shops, Street Names","The store is built on the site of the former Clough Mill which was demolished in the 1960s to allow for the widening of the entrance to Midgley Road.","Alan Greenwood ","Alan Greenwood","Pennine Horizons Digital Archive",2006,,"PHDA - Alan Greenwood Collection","Pennine Horizons Digital Archive","TIFF file 8-bit","English (U.K.)","Documentary photograph",AGW00279.tif,,,,,,,,,,,,,,,,,,,,,,,,,,,,,,,,,,,,"Building,Burnley Road,Midgley Road,Mytholmroyd,Places,Retail,Shop,Shops,Street Names",https://penninehorizons.org/files/original/f16b41474ae0c6cf4becca8f050204ea.jpg,"Still Image","Alan Greenwood Collection",1,0
26379,https://penninehorizons.org/items/show/26379,"Russell Dean's Furniture Store, Mytholmroyd - AGW00281","Building, Burnley Road, Mytholmroyd, Places, Retail, Shop, Shops, Street Names","The store is built on the site of the former Clough Mill which was demolished in the 1960s to allow for the widening of the entrance to Midgley Road.","Alan Greenwood ","Alan Greenwood","Pennine Horizons Digital Archive",2006,,"PHDA - Alan Greenwood Collection","Pennine Horizons Digital Archive","TIFF file 8-bit","English (U.K.)","Documentary photograph",AGW00281.tif,,,,,,,,,,,,,,,,,,,,,,,,,,,,,,,,,,,,"Building,Burnley Road,Mytholmroyd,Places,Retail,Shop,Shops,Street Names",https://penninehorizons.org/files/original/e1a9a64789f88e04c9f6f8df5a2f45cb.jpg,"Still Image","Alan Greenwood Collection",1,0
26386,https://penninehorizons.org/items/show/26386,"Russell Dean's Furniture Store, Mytholmroyd - AGW00288","Building, Burnley Road, Mytholmroyd, Places, Retail, Shop, Shops, Street Names","The store had been subjected to flooding on several occasions so this new design has car parking at the ground floor level with the store above. Here 16th april 2018 construction is almost complete.","Alan Greenwood ","Alan Greenwood","Pennine Horizons Digital Archive",2018,,"PHDA - Alan Greenwood Collection","Pennine Horizons Digital Archive","TIFF file 8-bit","English (U.K.)","Documentary photograph",AGW00288.tif,,,,,,,,,,,,,,,,,,,,,,,,,,,,,,,,,,,,"Building,Burnley Road,Mytholmroyd,Places,Retail,Shop,Shops,Street Names",https://penninehorizons.org/files/original/6dbbe3211b324410dd2aedff8f2bd6de.jpg,"Still Image","Alan Greenwood Collection",1,0
26387,https://penninehorizons.org/items/show/26387,"Russell Dean's Furniture Store, Mytholmroyd - AGW00289","Building, Burnley Road, Mytholmroyd, Places, Retail, Shop, Shops, Street Names","The store had been subjected to flooding on several occasions so this new design has car parking at the ground floor level with the store above. Here 16th april 2018 construction is almost complete.","Alan Greenwood ","Alan Greenwood","Pennine Horizons Digital Archive",2018,,"PHDA - Alan Greenwood Collection","Pennine Horizons Digital Archive","TIFF file 8-bit","English (U.K.)","Documentary photograph",AGW00289.tif,,,,,,,,,,,,,,,,,,,,,,,,,,,,,,,,,,,,"Building,Burnley Road,Mytholmroyd,Places,Retail,Shop,Shops,Street Names",https://penninehorizons.org/files/original/45da8806589839daa675c52d29524344.jpg,"Still Image","Alan Greenwood Collection",1,0
26388,https://penninehorizons.org/items/show/26388,"Russell Dean's Furniture Store, Mytholmroyd - AGW00290","Building, Burnley Road, Midgley Road, Mytholmroyd, Places, Retail, Shop, Shops, Street Names","The completed store on the junction of Burnley Road and Midgley Road.","Alan Greenwood ","Alan Greenwood","Pennine Horizons Digital Archive",2018,,"PHDA - Alan Greenwood Collection","Pennine Horizons Digital Archive","TIFF file 8-bit","English (U.K.)","Documentary photograph",AGW00290.tif,,,,,,,,,,,,,,,,,,,,,,,,,,,,,,,,,,,,"Building,Burnley Road,Midgley Road,Mytholmroyd,Places,Retail,Shop,Shops,Street Names",https://penninehorizons.org/files/original/020e309595b0c6b84229220374d048e9.jpg,"Still Image","Alan Greenwood Collection",1,0
26389,https://penninehorizons.org/items/show/26389,"Russell Dean's Furniture Store, Mytholmroyd - AGW00291","Building, Midgley Road, Mytholmroyd, Places, Retail, Shop, Shops, Street Names","Looking down Midgley Road with the completed store on the left.","Alan Greenwood ","Alan Greenwood","Pennine Horizons Digital Archive",2018,,"PHDA - Alan Greenwood Collection","Pennine Horizons Digital Archive","TIFF file 8-bit","English (U.K.)","Documentary photograph",AGW00291.tif,,,,,,,,,,,,,,,,,,,,,,,,,,,,,,,,,,,,"Building,Midgley Road,Mytholmroyd,Places,Retail,Shop,Shops,Street Names",https://penninehorizons.org/files/original/021d5d9ed2ec384b8c6a570bc2cba195.jpg,"Still Image","Alan Greenwood Collection",1,0
29828,https://penninehorizons.org/items/show/29828,"Steps off Buttress, Hebden Bridge  - HBW00256","Buttress, Hebden Bridge, Heptonstall Road, Steps, Street Names","Towards the Top","Andrew Bibby","Hebden Bridge Walkers Action","Pennine Horizons Digital Archive",2007-06-03T09:48:56,"Hebden Bridge Walkers Action","PHDA - Stepping Out Project","Pennine Horizons Digital Archive","TIFF file 8-bit","English (U.K.)","Documentary photograph",HBW00256.tif,,,,,,,,,,,,,,,,,,,,,,,,,,,,,,,,,,,,"Buttress,Hebden Bridge,Heptonstall Road,Steps,Street Names",https://penninehorizons.org/files/original/8198eddb2a7ba7055a5fdb0cbdb93bf6.jpg,"Still Image","Stepping Out Project",1,0
29830,https://penninehorizons.org/items/show/29830,"Steps from Heptonstall Road Into Lee Wood - HBW00258","Hebden Bridge, Heptonstall Road, Lee Wood, Steps, Street Names",,"Andrew Bibby","Hebden Bridge Walkers Action","Pennine Horizons Digital Archive",2007-06-03T09:45:09,"Hebden Bridge Walkers Action","PHDA - Stepping Out Project","Pennine Horizons Digital Archive","TIFF file 8-bit","English (U.K.)","Documentary photograph",HBW00258.tif,,,,,,,,,,,,,,,,,,,,,,,,,,,,,,,,,,,,"Hebden Bridge,Heptonstall Road,Lee Wood,Steps,Street Names",https://penninehorizons.org/files/original/91d2e5aff819e802dfd8091e3e063ebc.jpg,"Still Image","Stepping Out Project",1,0
29831,https://penninehorizons.org/items/show/29831,"Steps from Heptonstall Road Into Lee Wood - HBW00259","Hebden Bridge, Heptonstall Road, Lee Wood, Steps, Street Names",,"Andrew Bibby","Hebden Bridge Walkers Action","Pennine Horizons Digital Archive",2007-06-03T09:45:36,"Hebden Bridge Walkers Action","PHDA - Stepping Out Project","Pennine Horizons Digital Archive","TIFF file 8-bit","English (U.K.)","Documentary photograph",HBW00259.tif,,,,,,,,,,,,,,,,,,,,,,,,,,,,,,,,,,,,"Hebden Bridge,Heptonstall Road,Lee Wood,Steps,Street Names",https://penninehorizons.org/files/original/abce900a9851453658cb122b85cf4402.jpg,"Still Image","Stepping Out Project",1,0
29833,https://penninehorizons.org/items/show/29833,"Steps from Heptonstall Road Into Lee Wood - HBW00261","Hebden Bridge, Heptonstall Road, Lee Wood, Steps, Street Names",,"Andrew Bibby","Hebden Bridge Walkers Action","Pennine Horizons Digital Archive",2007-06-03T09:45:53,"Hebden Bridge Walkers Action","PHDA - Stepping Out Project","Pennine Horizons Digital Archive","TIFF file 8-bit","English (U.K.)","Documentary photograph",HBW00261.tif,,,,,,,,,,,,,,,,,,,,,,,,,,,,,,,,,,,,"Hebden Bridge,Heptonstall Road,Lee Wood,Steps,Street Names",https://penninehorizons.org/files/original/339c2d566cc6489e9faaa1aa3002e4c7.jpg,"Still Image","Stepping Out Project",1,0
29834,https://penninehorizons.org/items/show/29834,"Steps from Heptonstall Road Into Lee Wood - HBW00262","Hebden Bridge, Heptonstall Road, Lee Wood, Steps, Street Names","In the woods above the road to Hebden Hey Scout hostel","Andrew Bibby","Hebden Bridge Walkers Action","Pennine Horizons Digital Archive",2007-06-03T09:30:49,"Hebden Bridge Walkers Action","PHDA - Stepping Out Project","Pennine Horizons Digital Archive","TIFF file 8-bit","English (U.K.)","Documentary photograph",HBW00262.tif,,,,,,,,,,,,,,,,,,,,,,,,,,,,,,,,,,,,"Hebden Bridge,Heptonstall Road,Lee Wood,Steps,Street Names",https://penninehorizons.org/files/original/8df178a2faa739832157038327049c88.jpg,"Still Image","Stepping Out Project",1,0
318,https://penninehorizons.org/items/show/318,"Britsh Furtex, Luddenden Foot - ANP00106","Buildings, Burnley Road, Lorry, Luddendenfoot, Mill, Mills, Street Names, Textiles","The former mill on Burnley Road, opposite Station Road, has now been demolished and replaced with a private housing estate.","Ann Peters","Pennine Horizons Digital Archive","Pennine Horizons Digital Archive",1970s,"Ann Peters Collection","PHDA - Ann Peters Collection","Pennine Horizons Digital Archive","TIFF file 8-bit","English (U.K.)","Documentary photograph",ANP00106.tif,"Hebden Bridge",,,,,,,,,,,,,,,,,,,,,,,,,,,,,,,,,,,"Buildings,Burnley Road,Lorry,Luddendenfoot,Mill,Mills,Street Names,Textiles",https://penninehorizons.org/files/original/de20a0e0153c5a4bac5353d5955db533.jpg,"Still Image","Ann Peters collection",1,0
320,https://penninehorizons.org/items/show/320,"New Road, Luddenden - ANP00108","Cottages, Luddenden, New Road, Street Names",,"Ann Peters","Pennine Horizons Digital Archive","Pennine Horizons Digital Archive",1970s,"Ann Peters Collection","PHDA - Ann Peters Collection","Pennine Horizons Digital Archive","TIFF file 8-bit","English (U.K.)","Documentary photograph",ANP00108.tif,"Hebden Bridge",,,,,,,,,,,,,,,,,,,,,,,,,,,,,,,,,,,"Cottages,Luddenden,New Road,Street Names",https://penninehorizons.org/files/original/c37f0ebc38f21b49cc0ca561dd20368b.jpg,"Still Image","Ann Peters collection",1,0
340,https://penninehorizons.org/items/show/340,"High Street, Luddenden - ANP00128","High Street, Luddenden, Street Names","At the far end is the old C of E School with the old ‘lock-ups’ in the basement, now residential.","Ann Peters","Pennine Horizons Digital Archive","Pennine Horizons Digital Archive",1970s,"Ann Peters Collection","PHDA - Ann Peters Collection","Pennine Horizons Digital Archive","TIFF file 8-bit","English (U.K.)","Documentary photograph",ANP00128.tif,"Hebden Bridge",,,,,,,,,,,,,,,,,,,,,,,,,,,,,,,,,,,"High Street,Luddenden,Street Names",https://penninehorizons.org/files/original/0e5df3177c8a9cdedfb9d425e2dba6b7.jpg,"Still Image","Ann Peters collection",1,0
343,https://penninehorizons.org/items/show/343,"Luddenden - ANP00131","High Street, Houses, Luddenden, Street Names","The rear of buildings on High Street, between Halifax Lane and Stocks Lane. The building left of centre was formerly the Murgatroyd Arms, later Church House and now residential.","Ann Peters","Pennine Horizons Digital Archive","Pennine Horizons Digital Archive",1970s,"Ann Peters Collection","PHDA - Ann Peters Collection","Pennine Horizons Digital Archive","TIFF file 8-bit","English (U.K.)","Documentary photograph",ANP00131.tif,"Hebden Bridge",,,,,,,,,,,,,,,,,,,,,,,,,,,,,,,,,,,"High Street,Houses,Luddenden,Street Names",https://penninehorizons.org/files/original/94c90f22293a39f78cffb2e5e809f271.jpg,"Still Image","Ann Peters collection",1,0
