﻿"Item Id","Item URI","Dublin Core:Title","Dublin Core:Subject","Dublin Core:Description","Dublin Core:Creator","Dublin Core:Source","Dublin Core:Publisher","Dublin Core:Date","Dublin Core:Contributor","Dublin Core:Rights","Dublin Core:Relation","Dublin Core:Format","Dublin Core:Language","Dublin Core:Type","Dublin Core:Identifier","Dublin Core:Coverage","Item Type Metadata:Lesson Plan Text","Item Type Metadata:Bibliography","Item Type Metadata:Biographical Text","Item Type Metadata:Occupation","Item Type Metadata:Death Date","Item Type Metadata:Birthplace","Item Type Metadata:Birth Date","Item Type Metadata:Participants","Item Type Metadata:Event Type","Item Type Metadata:URL","Item Type Metadata:Bit Rate/Frequency","Item Type Metadata:Interviewer","Item Type Metadata:Interviewee","Item Type Metadata:Location","Item Type Metadata:Transcription","Item Type Metadata:Local URL","Item Type Metadata:Original Format","Item Type Metadata:Physical Dimensions","Item Type Metadata:Duration","Item Type Metadata:Compression","Item Type Metadata:Producer","Item Type Metadata:Director","Item Type Metadata:Text","Item Type Metadata:Time Summary","Item Type Metadata:Email Body","Item Type Metadata:Subject Line","Item Type Metadata:From","Item Type Metadata:To","Item Type Metadata:CC","Item Type Metadata:BCC","Item Type Metadata:Number of Attachments","Item Type Metadata:Standards","Item Type Metadata:Objectives","Item Type Metadata:Materials",tags,file,itemType,collection,public,featured
4545,https://penninehorizons.org/items/show/4545,"Cornholme - DMC00264","Buildings, Cornholme, Mill, Mills, Places, Portsmouth, Railway line, Valley",,"David Martin","Pennine Horizons Digital Archive","Pennine Horizons Digital Archive",2009-09-20T14:02:13,"David Martin","PHDA - David Martin Collection","Pennine Horizons Digital Archive","TIFF file 8-bit","English (U.K.)","Documentary photograph",DMC00264.TIF,",  ",,,,,,,,,,,,,,,,,,,,,,,,,,,,,,,,,,,"Buildings,Cornholme,Mill,Mills,Portsmouth,Railway line,Valley",https://penninehorizons.org/files/original/3118c3599c118bf36890de890ebec1a4.jpg,"Still Image","David's Own Pictures",1,0
9727,https://penninehorizons.org/items/show/9727,"Misty Morning in the Calder Valley - LLG00498","Farms, Fields, Landscape, Mist, Moors, Valley","Can anybody identify?",,"Pennine Horizons Digital Archive","Pennine Horizons Digital Archive","No date yet","Lloyd Greenwood","PHDA - Lloyd Greenwood Collection","Pennine Horizons Digital Archive","TIFF file 8-bit","English (U.K.)","Documentary photograph",LLG00498.tif,,,,,,,,,,,,,,,,,,,,,,,,,,,,,,,,,,,,"Farms,Fields,Landscape,Mist,Moors,Valley",https://penninehorizons.org/files/original/49b4f3e4d97dd8445a9569c6e5f9a517.jpg,"Still Image","Lloyd Greenwood collection",1,0
10473,https://penninehorizons.org/items/show/10473,"View over Todmorden - MOT00146","Buildings, Chimney, Chimneys, Church, Churches & Chapels, Churches_&_Chapels, Goods Wagons, Mill, Mills, Minster, Places, Railway, Railway Sidings, Railway station, Railways, Stoodley Pike, Todmorden, Town Hall, Valley","General view of Todmorden from Sunnyside in the early 1900s, with the main Manchester to Leeds railway lines arcing away to the left. The triangle not yet developed here.",Unknown,"Todmorden Information Centre Trust","Pennine Horizons Digital Archive","1895, 1900s","Todmorden Information Centre Trust","PHDA - Todmorden Information Centre Trust","Pennine Horizons Digital Archive","TIFF file 8-bit","English (U.K.)","Documentary photograph",MOT00146.tif,Todmorden,,,,,,,,,,,,,,,,,,,,,,,,,,,,,,,,,,,"Buildings,Chimney,Chimneys,Church,Churches and Chapels,Goods Wagons,Mill,Mills,Minster,Railway,Railway Sidings,Railway station,Railways,Stoodley Pike,Todmorden,Town Hall,Valley",https://penninehorizons.org/files/original/4d5eb47913f91db3d000187315ebf07a.jpg,"Still Image","The Making of Todmorden exhibition",1,0
10932,https://penninehorizons.org/items/show/10932,"Mytholmroyd - BIM00114","Canal, Canals, Donald Crossley, Midgley Moor, Mount Skip, Mytholmroyd, People, Places, Transport, Valley",BT434BM,"Bill Marsden","Bill Marsden","Pennine Horizons Digital Archive",1990s,,"PHDA - Bill Marsden Collection","Pennine Horizons Digital Archive","TIFF file 8-bit","English (U.K.)","Documentary photograph",BIM00114.tif,"Hebden Bridge",,,,,,,,,,,,,,,,,,,,,,,,,,,,,,,,,,,"Canal,Donald Crossley,Midgley Moor,Mount Skip,Mytholmroyd,People,Transport,Valley",https://penninehorizons.org/files/original/6be8ec406c0608a70a3a10d5d6ea8689.jpg,"Still Image","Bill Marsden collection",1,0
10938,https://penninehorizons.org/items/show/10938,"Mytholm - BIM00120","Autumn, Chimney, Chimneys, Mytholm, Seasons, Transport, Valley, garage",C01BMa,"Bill Marsden","Bill Marsden","Pennine Horizons Digital Archive",1990s,,"PHDA - Bill Marsden Collection","Pennine Horizons Digital Archive","TIFF file 8-bit","English (U.K.)","Documentary photograph",BIM00120.tif,"Hebden Bridge",,,,,,,,,,,,,,,,,,,,,,,,,,,,,,,,,,,"Autumn,Chimney,Chimneys,garage,Mytholm,Seasons,Transport,Valley",https://penninehorizons.org/files/original/cd7aa335454c21c2987bda02373127bf.jpg,"Still Image","Bill Marsden collection",1,0
10939,https://penninehorizons.org/items/show/10939,"Savile Road, Hebden Bridge - BIM00121","Hebden Bridge, Mytholm, Places, Stubbings, Valley",,"Bill Marsden","Bill Marsden","Pennine Horizons Digital Archive",1990s,119BM,"PHDA - Bill Marsden Collection","Pennine Horizons Digital Archive","TIFF file 8-bit","English (U.K.)","Documentary photograph",BIM00121.tif,"Hebden Bridge",,,,,,,,,,,,,,,,,,,,,,,,,,,,,,,,,,,"Hebden Bridge,Mytholm,Stubbings,Valley",https://penninehorizons.org/files/original/23c9387b49f74c2948226571a694046d.jpg,"Still Image","Bill Marsden collection",1,0
10940,https://penninehorizons.org/items/show/10940,"Savile Road,Mytholm, Hebden Bridge - BIM00122","Hebden Bridge, Mytholm, Places, Stubbings, Valley",,"Bill Marsden","Bill Marsden","Pennine Horizons Digital Archive",1990s,119BM2,"PHDA - Bill Marsden Collection","Pennine Horizons Digital Archive","TIFF file 8-bit","English (U.K.)","Documentary photograph",BIM00122.tif,"Hebden Bridge",,,,,,,,,,,,,,,,,,,,,,,,,,,,,,,,,,,"Hebden Bridge,Mytholm,Stubbings,Valley",https://penninehorizons.org/files/original/141f25e1b1b351e729761f3572115164.jpg,"Still Image","Bill Marsden collection",1,0
10943,https://penninehorizons.org/items/show/10943,"Stubbing, Hebden Bridge - BIM00125","Canal, Canals, Hebden Bridge, Mytholm, Places, Railway, Railways, Transport, Valley",At705BM,"Bill Marsden","Bill Marsden","Pennine Horizons Digital Archive",1990s,,"PHDA - Bill Marsden Collection","Pennine Horizons Digital Archive","TIFF file 8-bit","English (U.K.)","Documentary photograph",BIM00125.tif,"Hebden Bridge",,,,,,,,,,,,,,,,,,,,,,,,,,,,,,,,,,,"Canal,Hebden Bridge,Mytholm,Railway,Railways,Transport,Valley",https://penninehorizons.org/files/original/dc320520e583421bd54ca78cbab564c0.jpg,"Still Image","Bill Marsden collection",1,0
10950,https://penninehorizons.org/items/show/10950,"Highland cattle at Upper Foot - BIM00133","Animals, Canal, Canals, Landscape, Postcard, Transport, Valley","October 1999","Bill Marsden","Bill Marsden","Pennine Horizons Digital Archive",1990s,,"PHDA - Bill Marsden Collection","Pennine Horizons Digital Archive","TIFF file 8-bit","English (U.K.)","Documentary photograph",BIM00133.tif,"Hebden Bridge",,,,,,,,,,,,,,,,,,,,,,,,,,,,,,,,,,,"Animals,Canal,Landscape,Postcard,Transport,Valley",https://penninehorizons.org/files/original/b8fd7f9d2a5518f180c4d344afdf5bd1.jpg,"Still Image","Bill Marsden collection",1,0
10953,https://penninehorizons.org/items/show/10953,"Beacon Hill, Halifax - BIM00136","Halifax, Kite, Places, Postcard, Valley","Postcard. 1960s.","Bill Marsden","Bill Marsden","Pennine Horizons Digital Archive",1990s,,"PHDA - Bill Marsden Collection","Pennine Horizons Digital Archive","TIFF file 8-bit","English (U.K.)","Documentary photograph",BIM00136.tif,"Hebden Bridge",,,,,,,,,,,,,,,,,,,,,,,,,,,,,,,,,,,"Halifax,Kite,Postcard,Valley",https://penninehorizons.org/files/original/f007414274f22313ba1ff1ebd9ab0d09.jpg,"Still Image","Bill Marsden collection",1,0
10955,https://penninehorizons.org/items/show/10955,"Mist over Old town - BIM00138","Mist, Postcard, Valley","Postcard. 1960s.","Bill Marsden","Bill Marsden","Pennine Horizons Digital Archive",1990s,,"PHDA - Bill Marsden Collection","Pennine Horizons Digital Archive","TIFF file 8-bit","English (U.K.)","Documentary photograph",BIM00138.tif,"Hebden Bridge",,,,,,,,,,,,,,,,,,,,,,,,,,,,,,,,,,,"Mist,Postcard,Valley",https://penninehorizons.org/files/original/962de5adc9338d065d42bf249a1b2aee.jpg,"Still Image","Bill Marsden collection",1,0
10956,https://penninehorizons.org/items/show/10956,"View over Mytholmroyd - BIM00139","Calder High School, Mytholmroyd, Places, School, Valley","Calder high School is in the centre, Moderna Business park on the left, and Stoodley Pike on the sky-line.","Bill Marsden","Bill Marsden","Pennine Horizons Digital Archive",1990s,,"PHDA - Bill Marsden Collection","Pennine Horizons Digital Archive","TIFF file 8-bit","English (U.K.)","Documentary photograph",BIM00139.tif,"Hebden Bridge",,,,,,,,,,,,,,,,,,,,,,,,,,,,,,,,,,,"Calder High School,Mytholmroyd,School,Valley",https://penninehorizons.org/files/original/e200e7f00114771929fbe5fed2180748.jpg,"Still Image","Bill Marsden collection",1,0
11005,https://penninehorizons.org/items/show/11005,"View over Mytholmroyd - BIM00188","Railway, Railways, River, River Calder, Valley","Showing from left to right, the railway, the A646 road, the River Calder and the Rochdale Canal.","Bill Marsden","Bill Marsden","Pennine Horizons Digital Archive",1990s,,"PHDA - Bill Marsden Collection","Pennine Horizons Digital Archive","TIFF file 8-bit","English (U.K.)","Documentary photograph",BIM00188.tif,"Hebden Bridge",,,,,,,,,,,,,,,,,,,,,,,,,,,,,,,,,,,"Railway,Railways,River,River Calder,Valley",https://penninehorizons.org/files/original/e4fc7035ba7beb974b76ca1f9e36eaf2.jpg,"Still Image","Bill Marsden collection",1,0
11006,https://penninehorizons.org/items/show/11006,"View over Mytholmroyd - BIM00189","Canal, Canals, Mytholmroyd, Places, Transport, Valley","Moderna Trading Estate in the foreground, and Calder High School centre right","Bill Marsden","Bill Marsden","Pennine Horizons Digital Archive",1990s,,"PHDA - Bill Marsden Collection","Pennine Horizons Digital Archive","TIFF file 8-bit","English (U.K.)","Documentary photograph",BIM00189.tif,"Hebden Bridge",,,,,,,,,,,,,,,,,,,,,,,,,,,,,,,,,,,"Canal,Mytholmroyd,Transport,Valley",https://penninehorizons.org/files/original/0ed5117daafbb872fc61abf901a9bf40.jpg,"Still Image","Bill Marsden collection",1,0
11017,https://penninehorizons.org/items/show/11017,"Looking down on Mytholm - BIM00200","Mytholm, Snow, Valley, winter","At the bottom left corner can be seen the end of the red brick row of houses called Stubbing Brink. Bottom right are the flats at Mytholm Court (now demolished). 
","Bill Marsden","Bill Marsden","Pennine Horizons Digital Archive",1990s,,"PHDA - Bill Marsden Collection","Pennine Horizons Digital Archive","TIFF file 8-bit","English (U.K.)","Documentary photograph",BIM00200.tif,"Hebden Bridge",,,,,,,,,,,,,,,,,,,,,,,,,,,,,,,,,,,"Mytholm,Snow,Valley,winter",https://penninehorizons.org/files/original/e0990d3b606e2fdcf109565274ea4ad5.jpg,"Still Image","Bill Marsden collection",1,0
11018,https://penninehorizons.org/items/show/11018,"Bridge Gate, Hebden Bridge - BIM00201","Bridge Gate, Hebden Bridge, Hebden Water, Packhorse Bridge, Places, River, Snow, Street Names, Valley, winter",,"Bill Marsden","Bill Marsden","Pennine Horizons Digital Archive",1990s,,"PHDA - Bill Marsden Collection","Pennine Horizons Digital Archive","TIFF file 8-bit","English (U.K.)","Documentary photograph",BIM00201.tif,"Hebden Bridge",,,,,,,,,,,,,,,,,,,,,,,,,,,,,,,,,,,"Bridge Gate,Hebden Bridge,Hebden Water,Packhorse Bridge,River,Snow,Street Names,Valley,winter",https://penninehorizons.org/files/original/f0aad5a837d6b2cd807d806c99e82f05.jpg,"Still Image","Bill Marsden collection",1,0
11019,https://penninehorizons.org/items/show/11019," - BIM00202","Crimsworth, Crimsworth Dean, Crimsworth Dene, Crimsworthdean, Hebden Bridge, Places, Valley",,"Bill Marsden","Bill Marsden","Pennine Horizons Digital Archive",1990s,,"PHDA - Bill Marsden Collection","Pennine Horizons Digital Archive","TIFF file 8-bit","English (U.K.)","Documentary photograph",BIM00202.tif,"Hebden Bridge",,,,,,,,,,,,,,,,,,,,,,,,,,,,,,,,,,,"Crimsworth,Crimsworth Dean,Crimsworth Dene,Crimsworthdean,Hebden Bridge,Valley",https://penninehorizons.org/files/original/1413ada828642bf8de155610f2d73a39.jpg,"Still Image","Bill Marsden collection",1,0
11030,https://penninehorizons.org/items/show/11030,"Distant view of Heptonstall - BIM00213","Agricultural buildings, Agriculture, Church, Churches & Chapels, Churches_&_Chapels, Colour, Derelict, Heptonstall, Minster, Places, St Thomas a Becket, Valley","On the left is the near derelict great barn at Old Chamber.","Bill Marsden","Bill Marsden","Pennine Horizons Digital Archive",1990s,"A98 18A","PHDA - Bill Marsden Collection","Pennine Horizons Digital Archive","TIFF file 8-bit","English (U.K.)","Documentary photograph",BIM00213.tif,"Hebden Bridge",,,,,,,,,,,,,,,,,,,,,,,,,,,,,,,,,,,"Agriculture,Church,Churches and Chapels,Colour,Derelict,Heptonstall,Minster,St Thomas a Becket,Valley",https://penninehorizons.org/files/original/80da8759737f38a2af752de5ec8d9878.jpg,"Still Image","Bill Marsden collection",1,0
11031,https://penninehorizons.org/items/show/11031,"Looking down on Mytholmroyd from Midgely Road - BIM00214","Midgley Road, Mytholmroyd, Places, Street Names, Valley",,"Bill Marsden","Bill Marsden","Pennine Horizons Digital Archive",1990s,,"PHDA - Bill Marsden Collection","Pennine Horizons Digital Archive","TIFF file 8-bit","English (U.K.)","Documentary photograph",BIM00214.tif,"Hebden Bridge",,,,,,,,,,,,,,,,,,,,,,,,,,,,,,,,,,,"Midgley Road,Mytholmroyd,Street Names,Valley",https://penninehorizons.org/files/original/e74b1aecb4e612ec9d6c9f2f0d0bcd0a.jpg,"Still Image","Bill Marsden collection",1,0
11036,https://penninehorizons.org/items/show/11036,"View of Heptonstall from Pecket Well - BIM00219","Autumn, Colour, Heptonstall, Pecket, Places, Seasons, Stoodley Pike, Valley","Stoodley Pike on the far hillside.","Bill Marsden","Bill Marsden","Pennine Horizons Digital Archive",1990s,"A91 N3","PHDA - Bill Marsden Collection","Pennine Horizons Digital Archive","TIFF file 8-bit","English (U.K.)","Documentary photograph",BIM00219.tif,"Hebden Bridge",,,,,,,,,,,,,,,,,,,,,,,,,,,,,,,,,,,"Autumn,Colour,Heptonstall,Pecket,Seasons,Stoodley Pike,Valley",https://penninehorizons.org/files/original/9d65e2765ac508a2e616bcc70283f44b.jpg,"Still Image","Bill Marsden collection",1,0
11050,https://penninehorizons.org/items/show/11050,"View over Heptonstall - BIM00233","Autumn, Heptonstall, Places, Seasons, Stoodley Pike, Valley","Taken from Pecket with Stoodley Pike on the horizon","Bill Marsden","Bill Marsden","Pennine Horizons Digital Archive",1990s,,"PHDA - Bill Marsden Collection","Pennine Horizons Digital Archive","TIFF file 8-bit","English (U.K.)","Documentary photograph",BIM00233.tif,"Hebden Bridge",,,,,,,,,,,,,,,,,,,,,,,,,,,,,,,,,,,"Autumn,Heptonstall,Seasons,Stoodley Pike,Valley",https://penninehorizons.org/files/original/6e8dc7cfa0370bf7f4eb07ee92a2027e.jpg,"Still Image","Bill Marsden collection",1,0
11054,https://penninehorizons.org/items/show/11054,"View over Mytholmroyd - BIM00237","Colour, Mytholmroyd, Places, Valley",,"Bill Marsden","Bill Marsden","Pennine Horizons Digital Archive",1990s,,"PHDA - Bill Marsden Collection","Pennine Horizons Digital Archive","TIFF file 8-bit","English (U.K.)","Documentary photograph",BIM00237.tif,Mytholmroyd,,,,,,,,,,,,,,,,,,,,,,,,,,,,,,,,,,,"Colour,Mytholmroyd,Valley",https://penninehorizons.org/files/original/87d277e1db6f65fe6d5942830e92d494.jpg,"Still Image","Bill Marsden collection",1,0
11055,https://penninehorizons.org/items/show/11055,"View over Hebden Bridge - BIM00238","Hebden Bridge, Market Street, Places, Street Names, Valley","Looking down the valley in the Todmorden direction.  The tall chimney of the former Calder Mill is in the centre.  The Halifax Wireform Company were based in the mill premises until they were forced out by yet another flooding in (2015).  In 2018 police discovered nearly 2000 cannabis plants being grown in the mill. ","Bill Marsden","Bill Marsden","Pennine Horizons Digital Archive",1990s,,"PHDA - Bill Marsden Collection","Pennine Horizons Digital Archive","TIFF file 8-bit","English (U.K.)","Documentary photograph",BIM00238.tif,"Hebden Bridge",,,,,,,,,,,,,,,,,,,,,,,,,,,,,,,,,,,"Hebden Bridge,Market Street,Street Names,Valley",https://penninehorizons.org/files/original/8aec4da3d971b5091723edf44e875e15.jpg,"Still Image","Bill Marsden collection",1,0
11070,https://penninehorizons.org/items/show/11070,"Looking down on Booth. - BIM00253","Booth, Colour, Farm, Farm house, Farmhouse, Farms, Green House, Heights Farm, Landscape, Places, Valley",,"Bill Marsden","Bill Marsden","Pennine Horizons Digital Archive",1990s,,"PHDA - Bill Marsden Collection","Pennine Horizons Digital Archive","TIFF file 8-bit","English (U.K.)","Documentary photograph",BIM00253.tif,Booth,,,,,,,,,,,,,,,,,,,,,,,,,,,,,,,,,,,"Booth,Colour,Farm,Farm house,Farmhouse,Farms,Green House,Heights Farm,Landscape,Valley",https://penninehorizons.org/files/original/eae0f17c58fa0da7ec3b083de66338a6.jpg,"Still Image","Bill Marsden collection",1,0
11074,https://penninehorizons.org/items/show/11074,"Gauxholme Viaduct - BIM00257","Buildings, Canal, Canal Lock, Canals, Colour, Copperashouse, Mill, Mills, Places, Railway, Railway Viaduct, Railways, Rochdale Canal, Transport, Valley","Crossing the picture is the railway line as it goes over the road to Bacup at Gauxholme. Looking towards Littleborough, Copperas House Bridge over the Rochdale Canal can be seen further along the line. The former Mason's Arms can be seen in close proximity to the line.","Bill Marsden","Bill Marsden","Pennine Horizons Digital Archive",1990s,,"PHDA - Bill Marsden Collection","Pennine Horizons Digital Archive","TIFF file 8-bit","English (U.K.)","Documentary photograph",BIM00257.tif,Todmorden,,,,,,,,,,,,,,,,,,,,,,,,,,,,,,,,,,,"Buildings,Canal,Canal Lock,Colour,Copperashouse,Mill,Mills,Railway,Railway Viaduct,Railways,Rochdale Canal,Transport,Valley",https://penninehorizons.org/files/original/48bab0f2618840715ace8cf4bbdb6dff.jpg,"Still Image","Bill Marsden collection",1,0
