﻿"Item Id","Item URI","Dublin Core:Title","Dublin Core:Subject","Dublin Core:Description","Dublin Core:Creator","Dublin Core:Source","Dublin Core:Publisher","Dublin Core:Date","Dublin Core:Contributor","Dublin Core:Rights","Dublin Core:Relation","Dublin Core:Format","Dublin Core:Language","Dublin Core:Type","Dublin Core:Identifier","Dublin Core:Coverage","Item Type Metadata:Lesson Plan Text","Item Type Metadata:Bibliography","Item Type Metadata:Biographical Text","Item Type Metadata:Occupation","Item Type Metadata:Death Date","Item Type Metadata:Birthplace","Item Type Metadata:Birth Date","Item Type Metadata:Participants","Item Type Metadata:Event Type","Item Type Metadata:URL","Item Type Metadata:Bit Rate/Frequency","Item Type Metadata:Interviewer","Item Type Metadata:Interviewee","Item Type Metadata:Location","Item Type Metadata:Transcription","Item Type Metadata:Local URL","Item Type Metadata:Original Format","Item Type Metadata:Physical Dimensions","Item Type Metadata:Duration","Item Type Metadata:Compression","Item Type Metadata:Producer","Item Type Metadata:Director","Item Type Metadata:Text","Item Type Metadata:Time Summary","Item Type Metadata:Email Body","Item Type Metadata:Subject Line","Item Type Metadata:From","Item Type Metadata:To","Item Type Metadata:CC","Item Type Metadata:BCC","Item Type Metadata:Number of Attachments","Item Type Metadata:Standards","Item Type Metadata:Objectives","Item Type Metadata:Materials",tags,file,itemType,collection,public,featured
37944,https://penninehorizons.org/items/show/37944,"Yew Trees, Ovenden, Halifax - RAC1958.119.2","Vernacular Architecture",,,,"Pennine Horizons Digital Archive",,,"PHDA - Ralph Cross Collection","Pennine Horizons Digital Archive","TIFF file 8-bit","English (U.K.)","Documentary photograph",RAC1958.119.2.jpg,,,,,,,,,,,,,,,,,,,,,,,,,,,,,,,,,,,,"House,Vernacular architecture",https://penninehorizons.org/files/original/f86653cb6d8c4576b43468e4913f19e9.jpg,"Still Image","Ralph Cross 1958",1,0
37943,https://penninehorizons.org/items/show/37943,"Yew Trees, Ovenden, Halifax - RAC1958.119.1","Vernacular Architecture",,,,"Pennine Horizons Digital Archive",,,"PHDA - Ralph Cross Collection","Pennine Horizons Digital Archive","TIFF file 8-bit","English (U.K.)","Documentary photograph",RAC1958.119.1.jpg,,,,,,,,,,,,,,,,,,,,,,,,,,,,,,,,,,,,"Hoodmould,House,Vernacular architecture",https://penninehorizons.org/files/original/bff7d280ebece0b69133872cfffb5c9f.jpg,"Still Image","Ralph Cross 1958",1,0
37983,https://penninehorizons.org/items/show/37983,"Wraysholme tower - RAC1958.153.2","Vernacular Architecture",,,,"Pennine Horizons Digital Archive",,,"PHDA - Ralph Cross Collection","Pennine Horizons Digital Archive","TIFF file 8-bit","English (U.K.)","Documentary photograph",RAC1958.153.2.jpg,,,,,,,,,,,,,,,,,,,,,,,,,,,,,,,,,,,,"Canopies,Vernacular architecture",https://penninehorizons.org/files/original/6957a1f2b894ad1e18b4a49509b1b770.jpg,"Still Image","Ralph Cross 1958",1,0
37982,https://penninehorizons.org/items/show/37982,"Wraysholme tower - RAC1958.153.1","Vernacular Architecture",,,,"Pennine Horizons Digital Archive",,,"PHDA - Ralph Cross Collection","Pennine Horizons Digital Archive","TIFF file 8-bit","English (U.K.)","Documentary photograph",RAC1958.153.1.jpg,,,,,,,,,,,,,,,,,,,,,,,,,,,,,,,,,,,,"Barn,House,Tower,Vernacular architecture",https://penninehorizons.org/files/original/d06eb6015de0235841d862a5b46d7d73.jpg,"Still Image","Ralph Cross 1958",1,0
37657,https://penninehorizons.org/items/show/37657,"Winters, Blackshaw - RAC1961.087","Vernacular Architecture",,"Ralph Cross",,"Pennine Horizons Digital Archive",1961,,"PHDA - Ralph Cross Collection","Pennine Horizons Digital Archive","TIFF file 8-bit","English (U.K.)","Documentary photograph",RAC1961.087.jpg,,,,,,,,,,,,,,,,,,,,,,,,,,,,,,,,,,,,"Barn,Cart entry,Vernacular architecture",https://penninehorizons.org/files/original/1e8b0b92585548695d8b985eaafd4504.jpg,"Still Image","Ralph Cross 1961",1,0
37235,https://penninehorizons.org/items/show/37235,"Windy Bank, Littleborough, built 1635 - RAC1957.074.3","Architecture, Littleborough","House, Hoodmould, Chimney Stack, Hall and cross-wings, Garden, Vernacular architecture",,,"Pennine Horizons Digital Archive",1957,,"PHDA - Ralph Cross Collection","Pennine Horizons Digital Archive","TIFF file 8-bit","English (U.K.)","Documentary photograph",RAC1957.074.3.jpg,,,,,,,,,,,,,,,,,,,,,,,,,,,,,,,,,,,,"Chimney stack,Garden,Hall and cross-wings,Littleborough,Vernacular architecture",https://penninehorizons.org/files/original/c9172d43ad2a28b5557b625244488f66.jpg,"Still Image","Ralph Cross 1957",1,0
37234,https://penninehorizons.org/items/show/37234,"Windy Bank, Littleborough, built 1635 - RAC1957.074.2","Architecture, Littleborough","Hall and cross-wings, Chimney, Mullions, Hoodmould, Vernacular Architecture, Privies",,,"Pennine Horizons Digital Archive",1957,,"PHDA - Ralph Cross Collection","Pennine Horizons Digital Archive","TIFF file 8-bit","English (U.K.)","Documentary photograph",RAC1957.074.2.jpg,,,,,,,,,,,,,,,,,,,,,,,,,,,,,,,,,,,,"Architecture,Chimney,Hoodmould,Littleborough,Mullions,Privies,Vernacular architecture",https://penninehorizons.org/files/original/f00d9440fe30c0e302029debc1af45a7.jpg,"Still Image","Ralph Cross 1957",1,0
37233,https://penninehorizons.org/items/show/37233,"Windy Bank, Littleborough - RAC1957.074.1","Architecture, Littleborough","Vernacular Architecture, Chimney, House, Hall and cross-wings, Privies",,,"Pennine Horizons Digital Archive",1957,,"PHDA - Ralph Cross Collection","Pennine Horizons Digital Archive","TIFF file 8-bit","English (U.K.)","Documentary photograph",RAC1957.074.1.jpg,,,,,,,,,,,,,,,,,,,,,,,,,,,,,,,,,,,,"Architecture,Chimney,Hall and cross-wings,House,Littleborough,Privies,Vernacular architecture",https://penninehorizons.org/files/original/06df3ed374b7629eab880e7fc5b1c62d.jpg,"Still Image","Ralph Cross 1957",1,0
37713,https://penninehorizons.org/items/show/37713,"White Notley, Essex - RAC1961.114","Vernacular Architecture","Example of wattle and daub.","Ralph Cross",,"Pennine Horizons Digital Archive",1961,,"PHDA - Ralph Cross Collection","Pennine Horizons Digital Archive","TIFF file 8-bit","English (U.K.)","Documentary photograph",RAC1961.114.jpg,,,,,,,,,,,,,,,,,,,,,,,,,,,,,,,,,,,,"Derelict,Vernacular architecture,Wattle and daub",https://penninehorizons.org/files/original/fd6df1af43ddc2fa9f2f8468a7456145.jpg,"Still Image","Ralph Cross 1961",1,0
37583,https://penninehorizons.org/items/show/37583,"Wheatley Royd, Sowerby - RAC1961.051","Vernacular Architecture",,"Ralph Cross",,"Pennine Horizons Digital Archive",1961,,"PHDA - Ralph Cross Collection","Pennine Horizons Digital Archive","TIFF file 8-bit","English (U.K.)","Documentary photograph",RAC1961.051.jpg,,,,,,,,,,,,,,,,,,,,,,,,,,,,,,,,,,,,"Doorway,Hoodmould,Vernacular architecture",https://penninehorizons.org/files/original/df94ac55a2314713fab5083544f80c84.jpg,"Still Image","Ralph Cross 1961",1,0
37979,https://penninehorizons.org/items/show/37979,"Wheatley Lane Ingamite Chapel, Fence, Burnley - RAC1958.150","Vernacular Architecture",,,,"Pennine Horizons Digital Archive",,,"PHDA - Ralph Cross Collection","Pennine Horizons Digital Archive","TIFF file 8-bit","English (U.K.)","Documentary photograph",RAC1958.150.jpg,,,,,,,,,,,,,,,,,,,,,,,,,,,,,,,,,,,,"Chapel,Round Window,Sundial,Vernacular architecture",https://penninehorizons.org/files/original/6f1d87178e577aae5050db70c297d409.jpg,"Still Image","Ralph Cross 1958",1,0
37715,https://penninehorizons.org/items/show/37715,"Wheat Barn at Cressing Temple, Essex - RAC1961.115.2","Vernacular Architecture",,"Ralph Cross",,"Pennine Horizons Digital Archive",1961,,"PHDA - Ralph Cross Collection","Pennine Horizons Digital Archive","TIFF file 8-bit","English (U.K.)","Documentary photograph",RAC1961.115.2.jpg,,,,,,,,,,,,,,,,,,,,,,,,,,,,,,,,,,,,"Barn,Porch,Timber-framed,Vernacular architecture",https://penninehorizons.org/files/original/5490a5a46e69e99194952c1b025d0aef.jpg,"Still Image","Ralph Cross 1961",1,0
37714,https://penninehorizons.org/items/show/37714,"Wheat Barn at Cressing Temple, Essex - RAC1961.115.1","Vernacular Architecture",,"Ralph Cross",,"Pennine Horizons Digital Archive",1961,,"PHDA - Ralph Cross Collection","Pennine Horizons Digital Archive","TIFF file 8-bit","English (U.K.)","Documentary photograph",RAC1961.115.1.jpg,,,,,,,,,,,,,,,,,,,,,,,,,,,,,,,,,,,,"Barn,Interior,Timber-framed,Vernacular architecture",https://penninehorizons.org/files/original/19a8ee211fbd13136253f946f313d583.jpg,"Still Image","Ralph Cross 1961",1,0
37896,https://penninehorizons.org/items/show/37896,"West Ashenhurst - RAC1958.092.6","Vernacular Architecture",,,,"Pennine Horizons Digital Archive",,,"PHDA - Ralph Cross Collection","Pennine Horizons Digital Archive","TIFF file 8-bit","English (U.K.)","Documentary photograph",RAC1958.092.6.jpg,,,,,,,,,,,,,,,,,,,,,,,,,,,,,,,,,,,,"Interior,Re-used timber,Vernacular architecture",https://penninehorizons.org/files/original/0eb04759f11abeafe5be6f6de6719d4a.jpg,"Still Image","Ralph Cross 1958",1,0
37895,https://penninehorizons.org/items/show/37895,"West Ashenhurst - RAC1958.092.5","Vernacular Architecture",,,,"Pennine Horizons Digital Archive",,,"PHDA - Ralph Cross Collection","Pennine Horizons Digital Archive","TIFF file 8-bit","English (U.K.)","Documentary photograph",RAC1958.092.5.jpg,,,,,,,,,,,,,,,,,,,,,,,,,,,,,,,,,,,,"Vernacular architecture",https://penninehorizons.org/files/original/2a50a8477877c7cc17b9a515c4655099.jpg,"Still Image","Ralph Cross 1958",1,0
37566,https://penninehorizons.org/items/show/37566,"Watershot Masonry, Newchurch in Rossendale - RAC1961.040","Vernacular Architecture",,"Ralph Cross",,"Pennine Horizons Digital Archive",1961,,"PHDA - Ralph Cross Collection","Pennine Horizons Digital Archive","TIFF file 8-bit","English (U.K.)","Documentary photograph",RAC1961.040.jpg,,,,,,,,,,,,,,,,,,,,,,,,,,,,,,,,,,,,"Chimneys,Derelict,Vernacular architecture,Watershot stonework",https://penninehorizons.org/files/original/a389b994116cf3440819faafe96cb46a.jpg,"Still Image","Ralph Cross 1961",1,0
37516,https://penninehorizons.org/items/show/37516,"Waterbarn Farm, Stacksteads - RAC1961.001.3","Vernacular Architecture",,"Ralph Cross",,"Pennine Horizons Digital Archive",1961,,"PHDA - Ralph Cross Collection","Pennine Horizons Digital Archive","TIFF file 8-bit","English (U.K.)","Documentary photograph",RAC1961.001.3.jpg,,,,,,,,,,,,,,,,,,,,,,,,,,,,,,,,,,,,"Cottages,Vernacular architecture",https://penninehorizons.org/files/original/ff30b9a4b20a495d30f8cd24b8fec601.jpg,"Still Image","Ralph Cross 1961",1,0
37515,https://penninehorizons.org/items/show/37515,"Waterbarn Farm, Stacksteads - RAC1961.001.2","Vernacular Architecture",,"Ralph Cross",,"Pennine Horizons Digital Archive",1961,,"PHDA - Ralph Cross Collection","Pennine Horizons Digital Archive","TIFF file 8-bit","English (U.K.)","Documentary photograph",RAC1961.001.2.jpg,,,,,,,,,,,,,,,,,,,,,,,,,,,,,,,,,,,,"Datestone,Vernacular architecture,Walling",https://penninehorizons.org/files/original/142ed3bd2b4f2727e4155f0228024d5f.jpg,"Still Image","Ralph Cross 1961",1,0
37514,https://penninehorizons.org/items/show/37514,"Waterbarn Farm, Stacksteads - RAC1961.001.1","Vernacular Architecture",,"Ralph Cross",,"Pennine Horizons Digital Archive",1961,,"PHDA - Ralph Cross Collection","Pennine Horizons Digital Archive","TIFF file 8-bit","English (U.K.)","Documentary photograph",RAC1961.001.1.jpg,,,,,,,,,,,,,,,,,,,,,,,,,,,,,,,,,,,,"Cottages,Vernacular architecture",https://penninehorizons.org/files/original/f95861fc80d6b86118b6e04d20139d58.jpg,"Still Image","Ralph Cross 1961",1,0
37933,https://penninehorizons.org/items/show/37933,"Warcock Hill Farm, Blackshaw - RAC1958.111","Vernacular Architecture",,,,"Pennine Horizons Digital Archive",,,"PHDA - Ralph Cross Collection","Pennine Horizons Digital Archive","TIFF file 8-bit","English (U.K.)","Documentary photograph",RAC1958.111.jpg,,,,,,,,,,,,,,,,,,,,,,,,,,,,,,,,,,,,"Farmhouse,outshot,Vernacular architecture",https://penninehorizons.org/files/original/b9ef25622f3b8e3df9a15b6d6315a358.jpg,"Still Image","Ralph Cross 1958",1,0
37971,https://penninehorizons.org/items/show/37971,"Vine Cottage, Trawden - RAC1958.142.1","Vernacular Architecture",,,,"Pennine Horizons Digital Archive",,,"PHDA - Ralph Cross Collection","Pennine Horizons Digital Archive","TIFF file 8-bit","English (U.K.)","Documentary photograph",RAC1958.142.1.jpg,,,,,,,,,,,,,,,,,,,,,,,,,,,,,,,,,,,,"Interior,Plasterwork,Vernacular architecture",https://penninehorizons.org/files/original/c6b38b5860fb62800c788b14e6f8d7b4.jpg,"Still Image","Ralph Cross 1958",1,0
37215,https://penninehorizons.org/items/show/37215,"Upper Saltonstall, Wainstalls - RAC1957.058","Derelict House","Hall and cross-wing, Timber-framed, King post, Wall-plate",,,"Pennine Horizons Digital Archive",1957,,"PHDA - Ralph Cross Collection","Pennine Horizons Digital Archive","TIFF file 8-bit","English (U.K.)","Documentary photograph",RAC1957.058.jpg,,,,,,,,,,,,,,,,,,,,,,,,,,,,,,,,,,,,"Derelict,Hall and cross-wing,King Post,Timber-framed,Vernacular architecture,Wall-plate",https://penninehorizons.org/files/original/d9b6c052670ef20a1c5121843d082611.jpg,"Still Image","Ralph Cross 1957",1,0
37266,https://penninehorizons.org/items/show/37266,"Upper Quickstavers, Sowerby - RAC1957.097",,"Architecture, Mullion Window, Arch-headed window, Sowerby, Farm",,,"Pennine Horizons Digital Archive",1957,,"PHDA - Ralph Cross Collection","Pennine Horizons Digital Archive","TIFF file 8-bit","English (U.K.)","Documentary photograph",RAC1957.097.jpg,,,,,,,,,,,,,,,,,,,,,,,,,,,,,,,,,,,,"Arched-headed window,Farm,Mullion Window,Sowerby,Vernacular architecture",https://penninehorizons.org/files/original/6ad9d77d856a071ab89898113bca7791.jpg,"Still Image","Ralph Cross 1957",1,0
37395,https://penninehorizons.org/items/show/37395,"Upper Lumb, Cotton Stones - RAC1957.130.2",,"Architecture, Doorway, House, Double-recessed window, Lintel",,,"Pennine Horizons Digital Archive",1957,,"PHDA - Ralph Cross Collection","Pennine Horizons Digital Archive","TIFF file 8-bit","English (U.K.)","Documentary photograph",RAC1957.130.2.jpg,,,,,,,,,,,,,,,,,,,,,,,,,,,,,,,,,,,,"Doorway,Double-recessed window,House,Lintel,Vernacular architecture",https://penninehorizons.org/files/original/1f5c75fcb3fb90e8d1e754db40bd4d3d.jpg,"Still Image","Ralph Cross 1957",1,0
37394,https://penninehorizons.org/items/show/37394,"Upper Lumb, Cotton Stones - RAC1957.130.1",,"Architecture, Doorway, House, Double-recessed window, Lintel",,,"Pennine Horizons Digital Archive",1957,,"PHDA - Ralph Cross Collection","Pennine Horizons Digital Archive","TIFF file 8-bit","English (U.K.)","Documentary photograph",RAC1957.130.1.jpg,,,,,,,,,,,,,,,,,,,,,,,,,,,,,,,,,,,,"Doorway,Double-recessed window,House,Lintel,Vernacular architecture",https://penninehorizons.org/files/original/7d8879180578046740c0b623fbc1cd44.jpg,"Still Image","Ralph Cross 1957",1,0
