﻿"Item Id","Item URI","Dublin Core:Title","Dublin Core:Subject","Dublin Core:Description","Dublin Core:Creator","Dublin Core:Source","Dublin Core:Publisher","Dublin Core:Date","Dublin Core:Contributor","Dublin Core:Rights","Dublin Core:Relation","Dublin Core:Format","Dublin Core:Language","Dublin Core:Type","Dublin Core:Identifier","Dublin Core:Coverage","Item Type Metadata:Lesson Plan Text","Item Type Metadata:Bibliography","Item Type Metadata:Biographical Text","Item Type Metadata:Occupation","Item Type Metadata:Death Date","Item Type Metadata:Birthplace","Item Type Metadata:Birth Date","Item Type Metadata:Participants","Item Type Metadata:Event Type","Item Type Metadata:URL","Item Type Metadata:Bit Rate/Frequency","Item Type Metadata:Interviewer","Item Type Metadata:Interviewee","Item Type Metadata:Location","Item Type Metadata:Transcription","Item Type Metadata:Local URL","Item Type Metadata:Original Format","Item Type Metadata:Physical Dimensions","Item Type Metadata:Duration","Item Type Metadata:Compression","Item Type Metadata:Producer","Item Type Metadata:Director","Item Type Metadata:Text","Item Type Metadata:Time Summary","Item Type Metadata:Email Body","Item Type Metadata:Subject Line","Item Type Metadata:From","Item Type Metadata:To","Item Type Metadata:CC","Item Type Metadata:BCC","Item Type Metadata:Number of Attachments","Item Type Metadata:Standards","Item Type Metadata:Objectives","Item Type Metadata:Materials",tags,file,itemType,collection,public,featured
28707,https://penninehorizons.org/items/show/28707,"King Cross Street, Halifax - DPC00311","Halifax, King Cross, King Cross Street, streets",,,,"Pennine Horizons Digital Archive",,,"PHDA - Dave Pearson Collection","Pennine Horizons Digital Archive","TIFF file 8-bit","English (U.K.)","Documentary photograph",DPC00311.tif,,,,,,,,,,,,,,,,,,,,,,,,,,,,,,,,,,,,"Halifax,King Cross,King Cross Street,streets",https://penninehorizons.org/files/original/c7b17ef613c465537ff25043d60636eb.jpg,"Still Image","Dave Pearson",1,0
28708,https://penninehorizons.org/items/show/28708,"Commercial Street, Halifax - DPC00313","Commercial Street, Halifax, Street Names, streets",,,,"Pennine Horizons Digital Archive",,,"PHDA - Dave Pearson Collection","Pennine Horizons Digital Archive","TIFF file 8-bit","English (U.K.)","Documentary photograph",DPC00313.tif,,,,,,,,,,,,,,,,,,,,,,,,,,,,,,,,,,,,"Commercial Street,Halifax,Street Names,streets",https://penninehorizons.org/files/original/e08cbba681ad781d246f88b09b6db0f3.jpg,"Still Image","Dave Pearson",1,0
28714,https://penninehorizons.org/items/show/28714,"Old Market, Halifax - DPC00325","Halifax, Old Market, streets",,,,"Pennine Horizons Digital Archive",,,"PHDA - Dave Pearson Collection","Pennine Horizons Digital Archive","TIFF file 8-bit","English (U.K.)","Documentary photograph",DPC00325.tif,,,,,,,,,,,,,,,,,,,,,,,,,,,,,,,,,,,,"Halifax,Old Market,streets",https://penninehorizons.org/files/original/dc36189289b3c48dd15d62d12f4b44ad.jpg,"Still Image","Dave Pearson",1,0
28726,https://penninehorizons.org/items/show/28726,"Belvoir Gardens, Halifax - DPC00345","Belvoir Gardens, Halifax, Skircoat, Skircoat Green, St Albans Road, streets","This row of houses is in the Skircoat Road area of Halifax.",,,"Pennine Horizons Digital Archive",,,"PHDA - Dave Pearson Collection","Pennine Horizons Digital Archive","TIFF file 8-bit","English (U.K.)","Documentary photograph",DPC00345.tif,,,,,,,,,,,,,,,,,,,,,,,,,,,,,,,,,,,,"Belvoir Gardens,Halifax,Skircoat,Skircoat Green,St Albans Road,streets",https://penninehorizons.org/files/original/3d151811a04d1ca2dde8ea2925fd9459.jpg,"Still Image","Dave Pearson",1,0
28743,https://penninehorizons.org/items/show/28743,"Stafford Avenue, Halifax - DPC00369","Halifax, Skircoat, Stafford Avenue, streets","This lovely tree lined avenue is near the hospital in the town and leads to Huddersfield Road. It was and still is, one of the many desirable residential areas in the town. Postcard dated 1907.",,,"Pennine Horizons Digital Archive",,,"PHDA - Dave Pearson Collection","Pennine Horizons Digital Archive","TIFF file 8-bit","English (U.K.)","Documentary photograph",DPC00369.tif,,,,,,,,,,,,,,,,,,,,,,,,,,,,,,,,,,,,"Halifax,Skircoat,Stafford Avenue,streets",https://penninehorizons.org/files/original/ae540540888b67942715aa919605d183.jpg,"Still Image","Dave Pearson",1,0
28745,https://penninehorizons.org/items/show/28745,"Halifax, Southgate - DPC00371","Architecture, Borough Market, Building, Buildings, Halifax, Southgate, Town Hall, streets","The right hand side of the street here is very little changed since this photograph was taken. The fine facade of the Borough market remains intact today, although the street is pedestrianised. The clock tower of the Town Hall can be seen mid shot and most of the buildings on the left were replaced in the Edwardian period. It has always been a very popular shopping street. Postcard dated 1906.",,,"Pennine Horizons Digital Archive",,,"PHDA - Dave Pearson Collection","Pennine Horizons Digital Archive","TIFF file 8-bit","English (U.K.)","Documentary photograph",DPC00371.tif,,,,,,,,,,,,,,,,,,,,,,,,,,,,,,,,,,,,"Architecture,Borough Market,Building,Buildings,Halifax,Southgate,streets,Town Hall",https://penninehorizons.org/files/original/39b239bff3287c21ad6f7f82dd5de01d.jpg,"Still Image","Dave Pearson",1,0
28757,https://penninehorizons.org/items/show/28757,"Bull Green, Halifax - DPC00385","Bull Green, George Street, Halifax, Places, Townscape, Traffic, streets","One of the main gateways to the town, with the roundabout -although in a different form - still in existence today. The seating area is now occupied by a car park and to the right of the three storey buildings is now a new JD Wetherspoons. The area is known as Barum Top. Steam can be seen rising from the cooling towers of the power station which was in use until 1970, but it was 4 years later when the towers, known affectionately as 'salt and pepper, were demolished. Postcard dated 1955.",,,"Pennine Horizons Digital Archive",,,"PHDA - Dave Pearson Collection","Pennine Horizons Digital Archive","TIFF file 8-bit","English (U.K.)","Documentary photograph",DPC00385.tif,,,,,,,,,,,,,,,,,,,,,,,,,,,,,,,,,,,,"Bull Green,George Street,Halifax,Places,streets,Townscape,Traffic",https://penninehorizons.org/files/original/07def24e5041cdc9472fca83cec94459.jpg,"Still Image","Dave Pearson",1,0
30719,https://penninehorizons.org/items/show/30719,"Old Market, Halifax - DPC00401","Halifax, Old Market, Shops, streets","This evocative view is largely unchanged today, though the buildings are significantly cleaner! Some well known names: Freeman Hardy Willis, Boots and the Union Hotel reputedly the oldest inn in Halifax. Some of the buildings at the top left were demolished and replaced in the 1920s by the Burton's building. Postcard dated 1910.",,,"Pennine Horizons Digital Archive",,,"PHDA - Dave Pearson Collection","Pennine Horizons Digital Archive","TIFF file 8-bit","English (U.K.)","Documentary photograph",DPC00401.tif,,,,,,,,,,,,,,,,,,,,,,,,,,,,,,,,,,,,"Halifax,Old Market,Shops,streets",https://penninehorizons.org/files/original/b5d0d8a8a6611299940743776c4b8681.jpg,"Still Image","Dave Pearson",1,0
30725,https://penninehorizons.org/items/show/30725,"Wards End, Halifax - DPC00413","Halifax, Ramsdens brewery, Traffic Lights, Victoria Theatre, Wards End, streets","The Ramsden's Brewery building on the left of the picture was demolished and replaced by the very modern Halifax Building Society opened in the early 1980s. The roundabout is no longer there, traffic is controlled by lights today. Postcard dated 1969.",,,"Pennine Horizons Digital Archive",,,"PHDA - Dave Pearson Collection","Pennine Horizons Digital Archive","TIFF file 8-bit","English (U.K.)","Documentary photograph",DPC00413.tif,,,,,,,,,,,,,,,,,,,,,,,,,,,,,,,,,,,,"Halifax,Ramsdens brewery,streets,traffic lights,Victoria Theatre,Wards End",https://penninehorizons.org/files/original/90010ad1bb8c5479f636032c2747687b.jpg,"Still Image","Dave Pearson",1,0
30726,https://penninehorizons.org/items/show/30726,"The Borough Market Halifax - DPC00415","Borough Market, Building, Buildings, Halifax, Markets, Southgate, streets","This view is little changed today with the exception of the canopies and of course the carts and horses. And the stonework is considerably cleaner today. Postcard dated 1908.",,,"Pennine Horizons Digital Archive",,,"PHDA - Dave Pearson Collection","Pennine Horizons Digital Archive","TIFF file 8-bit","English (U.K.)","Documentary photograph",DPC00415.tif,,,,,,,,,,,,,,,,,,,,,,,,,,,,,,,,,,,,"Borough Market,Building,Buildings,Halifax,Markets,Southgate,streets",https://penninehorizons.org/files/original/88f84a7b82d2fc29d4ef97e4809d16d8.jpg,"Still Image","Dave Pearson",1,0
30728,https://penninehorizons.org/items/show/30728,"Union Street, Halifax - DPC00419","Halifax, Places, Street Names, Union Street, Woolshops, lower market, streets","The view along this street bears no resemblance to today's scene apart from the lower end of the Borough Market on the right. The only building that remained after the redevelopment in the 1980s is on the right with the two gable ends and is now a cafe. The lower market specialised in second hand goods and fruit and vegetables.",,,"Pennine Horizons Digital Archive",,,"PHDA - Dave Pearson Collection","Pennine Horizons Digital Archive","TIFF file 8-bit","English (U.K.)","Documentary photograph",DPC00419.tif,,,,,,,,,,,,,,,,,,,,,,,,,,,,,,,,,,,,"Halifax,lower market,Places,Street Names,streets,Union Street,Woolshops",https://penninehorizons.org/files/original/22bd7dcbbb32853096b56a7ba623ded3.jpg,"Still Image","Dave Pearson",1,0
30732,https://penninehorizons.org/items/show/30732,"Wards End, Halifax - DPC00427","Commercial Street, Halifax, Street Names, streets",,,,"Pennine Horizons Digital Archive",,,"PHDA - Dave Pearson Collection","Pennine Horizons Digital Archive","TIFF file 8-bit","English (U.K.)","Documentary photograph",DPC00427.tif,,,,,,,,,,,,,,,,,,,,,,,,,,,,,,,,,,,,"Commercial Street,Halifax,Street Names,streets",https://penninehorizons.org/files/original/e1ab27fa42528894dfbb75faa58a5fe0.jpg,"Still Image","Dave Pearson",1,0
30733,https://penninehorizons.org/items/show/30733,"Union Street Tram Terminus, Halifax - DPC00429","Halifax, Street Names, Union Street, streets","This view is the lower end of Union Street with Westgate on the right (sign visible above the gent leaning on the lamp-post). The shop fronts on the left remain today, the date of the picture is probably the 1920s. The cobbles and tramlines have gone.",,,"Pennine Horizons Digital Archive",,,"PHDA - Dave Pearson Collection","Pennine Horizons Digital Archive","TIFF file 8-bit","English (U.K.)","Documentary photograph",DPC00429.tif,,,,,,,,,,,,,,,,,,,,,,,,,,,,,,,,,,,,"Halifax,Street Names,streets,Union Street",https://penninehorizons.org/files/original/52205ffaf54390a7fdc0df0da62cb1a7.jpg,"Still Image","Dave Pearson",1,0
30735,https://penninehorizons.org/items/show/30735,"Horton Street, Halifax - DPC00433","Halifax, Horton Street, streets","This street leads down to the railway station and is quite steep. Most of the buildings remain today and have had a variety of guises. The Albert Works building was at one time a furniture store and the building on the left was at one time one of Halifax's first supermarkets. Note the ice cream cart bottom left.",,,"Pennine Horizons Digital Archive",,,"PHDA - Dave Pearson Collection","Pennine Horizons Digital Archive","TIFF file 8-bit","English (U.K.)","Documentary photograph",DPC00433.tif,,,,,,,,,,,,,,,,,,,,,,,,,,,,,,,,,,,,"Halifax,Horton Street,streets",https://penninehorizons.org/files/original/80415ab36eda6ebaccf304bd07af521f.jpg,"Still Image","Dave Pearson",1,0
30736,https://penninehorizons.org/items/show/30736,"Huddersfield Road, Halifax - DPC00435","Halifax, Huddersfield road, streets","This is the main road from Halifax to Huddersfield and there are many fine houses lining it, probably residences of wealthy merchants and mill owners. The Stafford Arms Inn on the left is now an Indian restaurant.",,,"Pennine Horizons Digital Archive",,,"PHDA - Dave Pearson Collection","Pennine Horizons Digital Archive","TIFF file 8-bit","English (U.K.)","Documentary photograph",DPC00435.tif,,,,,,,,,,,,,,,,,,,,,,,,,,,,,,,,,,,,"Halifax,Huddersfield road,streets",https://penninehorizons.org/files/original/3c9c48673ea6738e2071c37cbec2be24.jpg,"Still Image","Dave Pearson",1,0
30743,https://penninehorizons.org/items/show/30743,"Borough Market and arcades, Halifax - DPC00449","Borough Market, Building, Buildings, Halifax, Markets, Street Names, Union Street, streets","The date on the reverse of this card is 1940 and the buildings on the left remain today, although they are very much cleaner. The buildings on the right were all demolished to make way for the Woolshops development in the 1980s. The building to the right of the lamppost (with the  lorry outside) was the bottom market. It sold fruit and vegetables and second hand goods. Postcard dated October 1940.",,,"Pennine Horizons Digital Archive",,,"PHDA - Dave Pearson Collection","Pennine Horizons Digital Archive","TIFF file 8-bit","English (U.K.)","Documentary photograph",DPC00449.tif,,,,,,,,,,,,,,,,,,,,,,,,,,,,,,,,,,,,"Borough Market,Building,Buildings,Halifax,Markets,Street Names,streets,Union Street",https://penninehorizons.org/files/original/26eec3f99582b4909bdb71b3228961f4.jpg,"Still Image","Dave Pearson",1,0
30747,https://penninehorizons.org/items/show/30747,"Bull Green, Halifax - DPC00457","Bull Green, Halifax, Places, streets","This view is very similar today except where the seats once were is now car parking. The building on the right no longer exists and the road junction is now a roundabout. The Crown and Anchor pub has had a variety of names over the years and the large building wiht the arched windows was the Bull's Head for many years and a popular nightspot in the 1970s.",,,"Pennine Horizons Digital Archive",,,"PHDA - Dave Pearson Collection","Pennine Horizons Digital Archive","TIFF file 8-bit","English (U.K.)","Documentary photograph",DPC00457.tif,,,,,,,,,,,,,,,,,,,,,,,,,,,,,,,,,,,,"Bull Green,Halifax,Places,streets",https://penninehorizons.org/files/original/9e111538720c55ae195eb1d8a1f4eac8.jpg,"Still Image","Dave Pearson",1,0
30757,https://penninehorizons.org/items/show/30757,"Silver Street, Halifax - DPC00477","Halifax, Silver Street, streets","This street is off Huddersfield Road and leads down to the town centre. The Victory Lounge on the right was a popular venue in the 1920s and 30s, probably when this image was captured. Most of the buldings remain today.",,"Pennine Horizons Digital Archive","Pennine Horizons Digital Archive",,,"PHDA - Dave Pearson Collection","Pennine Horizons Digital Archive","TIFF file 8-bit","English (U.K.)","Documentary photograph",DPC00477.tif,,,,,,,,,,,,,,,,,,,,,,,,,,,,,,,,,,,,"Halifax,Silver Street,streets",https://penninehorizons.org/files/original/9368280ca6460b7275c26882e98f1f20.jpg,"Still Image","Dave Pearson",1,0
30758,https://penninehorizons.org/items/show/30758,"North Bridge - DPC00479","Cross Hills, Halifax, North Bridge, streets","The Grand Theatre on the right was one of several in Halifax at one time, it was demolished  in the 1950s. North Bridge (unseen) is to the right and the road leads to Leeds and Bradford. The building in the centre remains today, but the street on the left of it has mostly gone, along with the chimneys.",,"Pennine Horizons Digital Archive","Pennine Horizons Digital Archive",,,"PHDA - Dave Pearson Collection","Pennine Horizons Digital Archive","TIFF file 8-bit","English (U.K.)","Documentary photograph",DPC00479.tif,,,,,,,,,,,,,,,,,,,,,,,,,,,,,,,,,,,,"Cross Hills,Halifax,North Bridge,streets",https://penninehorizons.org/files/original/60dad81f062fb7d2e3796d15dbab2b1d.jpg,"Still Image","Dave Pearson",1,0
30760,https://penninehorizons.org/items/show/30760,"Roils Head road, Halifax - DPC00483","Halifax, Norton Towers, Roils Head Road, streets",,,"Pennine Horizons Digital Archive","Pennine Horizons Digital Archive",,,"PHDA - Dave Pearson Collection","Pennine Horizons Digital Archive","TIFF file 8-bit","English (U.K.)","Documentary photograph",DPC00483.tif,,,,,,,,,,,,,,,,,,,,,,,,,,,,,,,,,,,,"Halifax,Norton Towers,Roils Head Road,streets",https://penninehorizons.org/files/original/91b0e1f2ee616d5769287dccc89c4042.jpg,"Still Image","Dave Pearson",1,0
30765,https://penninehorizons.org/items/show/30765,"Halifax  - DPC00493","Halifax, Northgate, Southgate, streets","These busy shopping streets are little changed today, apart from being considerably cleaner! The building on the left on Southgate was rebuilt and was for many years a Woolworth's. The Northgate view on the right shows the buildings which were demolished to make way for the Calderdale MBC offices and the 'new' library opened in the 1970s.",,"Pennine Horizons Digital Archive","Pennine Horizons Digital Archive",,,"PHDA - Dave Pearson Collection","Pennine Horizons Digital Archive","TIFF file 8-bit","English (U.K.)","Documentary photograph",DPC00493.tif,,,,,,,,,,,,,,,,,,,,,,,,,,,,,,,,,,,,"Halifax,Northgate,Southgate,streets",https://penninehorizons.org/files/original/28faea7863373a7444bd5b660fd7482d.jpg,"Still Image","Dave Pearson",1,0
30785,https://penninehorizons.org/items/show/30785,"The Post Office - DPC00533","Commercial Street, Halifax, Post Office, Street Names, streets","The very handsome Post Office building on Commercial Street, now disused, with the main office at present in the WH Smith shop at Woolshops. The shop on the left was for many years a very popular toyshop.",,"Pennine Horizons Digital Archive","Pennine Horizons Digital Archive",,,"PHDA - Dave Pearson Collection","Pennine Horizons Digital Archive","TIFF file 8-bit","English (U.K.)","Documentary photograph",DPC00533.tif,,,,,,,,,,,,,,,,,,,,,,,,,,,,,,,,,,,,"Commercial Street,Halifax,Post Office,Street Names,streets",https://penninehorizons.org/files/original/0ba41dac51a2083e087aa18cc6b2f35e.jpg,"Still Image","Dave Pearson",1,0
30786,https://penninehorizons.org/items/show/30786,"The Post Office, Halifax - DPC00535","Commercial Street, Halifax, Street Names, streets","The very handsome Post Office building on Commercial Street, now disused, with the main office at present in the WH Smith shop at Woolshops. The shop on the left was for many years a very popular toyshop. Postcard dated 1019.",,"Pennine Horizons Digital Archive","Pennine Horizons Digital Archive",,,"PHDA - Dave Pearson Collection","Pennine Horizons Digital Archive","TIFF file 8-bit","English (U.K.)","Documentary photograph",DPC00535.tif,,,,,,,,,,,,,,,,,,,,,,,,,,,,,,,,,,,,"Commercial Street,Halifax,Street Names,streets",https://penninehorizons.org/files/original/fdc3ffee26f13114f9d48de7d1d5da7b.jpg,"Still Image","Dave Pearson",1,0
30793,https://penninehorizons.org/items/show/30793,"King Edward Street and Arcade Royale, Halifax - DPC00550","Arcade Royale, Halifax, King Edward Street, streets","These impressive buildings were used for many years by the Cooperative and had many departments: clothing, furniture, a pharmacy and even a travel agent! The view down this street is unchanged today, apart from the road surface.",,"Pennine Horizons Digital Archive","Pennine Horizons Digital Archive",,,"PHDA - Dave Pearson Collection","Pennine Horizons Digital Archive","TIFF file 8-bit","English (U.K.)","Documentary photograph",DPC00550.tif,,,,,,,,,,,,,,,,,,,,,,,,,,,,,,,,,,,,"Arcade Royale,Halifax,King Edward Street,streets",https://penninehorizons.org/files/original/55dca5d9f8535d16cb71c59a57610066.jpg,"Still Image","Dave Pearson",1,0
30794,https://penninehorizons.org/items/show/30794,"Silver Street, Halifax - DPC00552","Halifax, Silver Street, streets","This busy street in the town centre is largely unchanged today.",,"Pennine Horizons Digital Archive","Pennine Horizons Digital Archive",,,"PHDA - Dave Pearson Collection","Pennine Horizons Digital Archive","TIFF file 8-bit","English (U.K.)","Documentary photograph",DPC00552.tif,,,,,,,,,,,,,,,,,,,,,,,,,,,,,,,,,,,,"Halifax,Silver Street,streets",https://penninehorizons.org/files/original/1ce2ce35ed478a8fdc82615bf46ee27a.jpg,"Still Image","Dave Pearson",1,0
