﻿"Item Id","Item URI","Dublin Core:Title","Dublin Core:Subject","Dublin Core:Description","Dublin Core:Creator","Dublin Core:Source","Dublin Core:Publisher","Dublin Core:Date","Dublin Core:Contributor","Dublin Core:Rights","Dublin Core:Relation","Dublin Core:Format","Dublin Core:Language","Dublin Core:Type","Dublin Core:Identifier","Dublin Core:Coverage","Item Type Metadata:Lesson Plan Text","Item Type Metadata:Bibliography","Item Type Metadata:Biographical Text","Item Type Metadata:Occupation","Item Type Metadata:Death Date","Item Type Metadata:Birthplace","Item Type Metadata:Birth Date","Item Type Metadata:Participants","Item Type Metadata:Event Type","Item Type Metadata:URL","Item Type Metadata:Bit Rate/Frequency","Item Type Metadata:Interviewer","Item Type Metadata:Interviewee","Item Type Metadata:Location","Item Type Metadata:Transcription","Item Type Metadata:Local URL","Item Type Metadata:Original Format","Item Type Metadata:Physical Dimensions","Item Type Metadata:Duration","Item Type Metadata:Compression","Item Type Metadata:Producer","Item Type Metadata:Director","Item Type Metadata:Text","Item Type Metadata:Time Summary","Item Type Metadata:Email Body","Item Type Metadata:Subject Line","Item Type Metadata:From","Item Type Metadata:To","Item Type Metadata:CC","Item Type Metadata:BCC","Item Type Metadata:Number of Attachments","Item Type Metadata:Standards","Item Type Metadata:Objectives","Item Type Metadata:Materials",tags,file,itemType,collection,public,featured
40683,https://penninehorizons.org/items/show/40683,"Demolition on Lister Lane, Halifax - RAC1960.007.1","Demolition, Stud, Vernacular_architecture, rafters, timber_frame, wall_plate^^Vernacular Architecture",,"Ralph Cross",,"Pennine Horizons Digital Archive",1960,,"PHDA - -Ralph Cross Collection","Pennine Horizons Digital Archive","TIFF file 8-bit","English (U.K.)","Documentary photograph",RAC1960.007.1.jpg,,,,,,,,,,,,,,,,,,,,,,,,,,,,,,,,,,,,"Demolition,rafters,stud,timber_frame,Vernacular_architecture,wall_plate",https://penninehorizons.org/files/original/4c9698f042d25a6c4d533bf939e46334.jpg,"Still Image","Ralph Cross 1960",1,0
40684,https://penninehorizons.org/items/show/40684,"Demolition on Lister Lane, Halifax - RAC1960.007.2","Chimney, Demolition, Vernacular_architecture, rafters, setts, timber_frame, wall_plate^^Vernacular Architecture",,"Ralph Cross",,"Pennine Horizons Digital Archive",1960,,"PHDA - -Ralph Cross Collection","Pennine Horizons Digital Archive","TIFF file 8-bit","English (U.K.)","Documentary photograph",RAC1960.007.2.jpg,,,,,,,,,,,,,,,,,,,,,,,,,,,,,,,,,,,,"Chimney,Demolition,rafters,Setts,timber_frame,Vernacular_architecture,wall_plate",https://penninehorizons.org/files/original/7c9f490c7a35b53ccdf7a3d3c06d2e95.jpg,"Still Image","Ralph Cross 1960",1,0
40685,https://penninehorizons.org/items/show/40685,"Demolition on Lister Lane, Halifax - RAC1960.007.3","Demolition, Stud, Vernacular_architecture, brace, post, timber_frame, wall_plate^^Vernacular Architecture",,"Ralph Cross",,"Pennine Horizons Digital Archive",1960,,"PHDA - -Ralph Cross Collection","Pennine Horizons Digital Archive","TIFF file 8-bit","English (U.K.)","Documentary photograph",RAC1960.007.3.jpg,,,,,,,,,,,,,,,,,,,,,,,,,,,,,,,,,,,,"Brace,Demolition,Post,stud,timber_frame,Vernacular_architecture,wall_plate",https://penninehorizons.org/files/original/2729f3f0b2ab09d6bba59a5634589cc3.jpg,"Still Image","Ralph Cross 1960",1,0
40686,https://penninehorizons.org/items/show/40686,"Demolition on Lister Lane, Halifax - RAC1960.007.4","Demolition, Stud, Vernacular_architecture, brace, post, timber_frame, wall_plate^^Vernacular Architecture",,"Ralph Cross",,"Pennine Horizons Digital Archive",1960,,"PHDA - -Ralph Cross Collection","Pennine Horizons Digital Archive","TIFF file 8-bit","English (U.K.)","Documentary photograph",RAC1960.007.4.jpg,,,,,,,,,,,,,,,,,,,,,,,,,,,,,,,,,,,,"Brace,Demolition,Post,stud,timber_frame,Vernacular_architecture,wall_plate",https://penninehorizons.org/files/original/8b615411d172b9e779fd754f97ae77b8.jpg,"Still Image","Ralph Cross 1960",1,0
40689,https://penninehorizons.org/items/show/40689,"Demolition on Lister Lane, Halifax - RAC1960.007.7","Demolition, Staircase, Stud, Vernacular_architecture, brace, post, timber_frame, wall_plate^^Vernacular Architecture",,"Ralph Cross",,"Pennine Horizons Digital Archive",1960,,"PHDA - -Ralph Cross Collection","Pennine Horizons Digital Archive","TIFF file 8-bit","English (U.K.)","Documentary photograph",RAC1960.007.7.jpg,,,,,,,,,,,,,,,,,,,,,,,,,,,,,,,,,,,,"Brace,Demolition,Post,Staircase,stud,timber_frame,Vernacular_architecture,wall_plate",https://penninehorizons.org/files/original/f0a1a9397eef714bac7b48fd05fddbc7.jpg,"Still Image","Ralph Cross 1960",1,0
40690,https://penninehorizons.org/items/show/40690,"Demolition on Lister Lane, Halifax - RAC1960.007.8","Demolition, Stud, Vernacular_architecture, brace, post, timber_frame, wall_plate^^Vernacular Architecture",,"Ralph Cross",,"Pennine Horizons Digital Archive",1960,,"PHDA - -Ralph Cross Collection","Pennine Horizons Digital Archive","TIFF file 8-bit","English (U.K.)","Documentary photograph",RAC1960.007.8.jpg,,,,,,,,,,,,,,,,,,,,,,,,,,,,,,,,,,,,"Brace,Demolition,Post,stud,timber_frame,Vernacular_architecture,wall_plate",https://penninehorizons.org/files/original/5523ec3a73aaf89aadd1f6e463154bf3.jpg,"Still Image","Ralph Cross 1960",1,0
40691,https://penninehorizons.org/items/show/40691,"Demolition on Lister Lane, Halifax - RAC1960.007.9","Demolition, Stud, Vernacular_architecture, brace, post, timber_frame, wall_plate^^Vernacular Architecture",,,,"Pennine Horizons Digital Archive",,,"PHDA - -Ralph Cross Collection","Pennine Horizons Digital Archive","TIFF file 8-bit","English (U.K.)","Documentary photograph",RAC1960.007.9.jpg,,,,,,,,,,,,,,,,,,,,,,,,,,,,,,,,,,,,"Brace,Demolition,Post,stud,timber_frame,Vernacular_architecture,wall_plate",https://penninehorizons.org/files/original/a5f90b0c64bd41bcb0391d54a2b621ea.jpg,"Still Image","Ralph Cross 1960",1,0
40692,https://penninehorizons.org/items/show/40692,"Demolition on Lister Lane, Halifax - RAC1960.007.10","Demolition, Stud, Vernacular_architecture, brace, mid_rail, post, timber_frame, wall_plate^^Vernacular Architecture",,"Ralph Cross",,"Pennine Horizons Digital Archive",1960,,"PHDA - -Ralph Cross Collection","Pennine Horizons Digital Archive","TIFF file 8-bit","English (U.K.)","Documentary photograph",RAC1960.007.10.jpg,,,,,,,,,,,,,,,,,,,,,,,,,,,,,,,,,,,,"Brace,Demolition,mid_rail,Post,stud,timber_frame,Vernacular_architecture,wall_plate",https://penninehorizons.org/files/original/27d47e6b2d28ac259c9c2af337eac554.jpg,"Still Image","Ralph Cross 1960",1,0
